{"text_format":"1","workbook":"xlsx","n_sheets":16,"sheets":["SAN","c2Sp_Sext_cab_spital","IAAM","Transfuzii","c2Sp_Sext_cab_ambulator","c2Amb_spec","c3tbcSp_Sext","c1","c4","c7","c10","c14","c15","Laboratoare_sali_operatie","Mama","Copac2022"],"not_rendered":{"charts":0,"images":2,"macros":1,"external_links":0,"defined_names":258,"comments":0,"pivot_tables":0},"unopened":[],"bounds":{"document_bytes":16777216,"sheet_cells":100000,"rows_first":2000,"rows_last":500,"rows_between":2000,"halvings":0,"cell_chars":16384,"cell_head_chars":4096},"cells_cut":0,"cells_raw":0,"read":"whole","date_system":"1900"}

{"sheet":"SAN","index":0,"n_rows":564,"n_cols":22,"rows_kept":564,"cut":false,"hidden":false,"merged":[[28,11,28,15],[29,11,29,15],[30,11,30,15],[19,11,19,15],[20,11,20,15],[21,11,21,15],[22,11,22,15],[23,11,23,15],[24,11,24,15],[25,11,25,15],[26,11,26,15],[27,11,27,15],[529,8,530,8],[529,9,530,9],[529,10,530,10],[529,11,530,11],[529,12,529,13],[527,0,527,12],[528,0,530,0],[528,1,530,1],[528,2,530,2],[528,3,528,13],[529,3,530,3],[529,4,530,4],[529,5,530,5],[529,6,530,6],[529,7,530,7],[512,5,513,5],[512,6,513,6],[512,7,513,7],[512,8,513,8],[512,9,513,9],[512,10,513,10],[509,0,509,10],[510,0,513,0],[510,1,513,1],[510,2,513,2],[510,3,510,11],[511,3,511,8],[511,9,511,10],[511,11,513,11],[512,3,513,3],[512,4,513,4],[473,9,475,9],[473,10,475,10],[473,11,475,11],[473,12,475,12],[474,6,475,6],[474,7,474,8],[471,0,471,11],[472,0,475,0],[472,1,475,1],[472,2,475,2],[472,3,472,10],[472,11,472,12],[473,3,475,3],[473,4,475,4],[473,5,475,5],[473,6,473,8],[448,0,450,0],[448,1,450,1],[325,14,326,15],[326,8,327,8],[326,9,327,9],[326,10,326,11],[455,9,457,9],[455,10,457,10],[455,11,457,11],[455,12,457,12],[456,6,457,6],[456,7,456,8],[453,0,453,11],[454,0,457,0],[454,1,457,1],[454,2,457,2],[454,3,454,10],[454,11,454,12],[455,3,457,3],[455,4,457,4],[455,5,457,5],[455,6,455,8],[448,2,448,4],[448,5,449,6],[385,16,391,16],[386,0,389,0],[386,1,389,1],[386,2,389,2],[386,3,389,3],[386,4,387,7],[324,4,324,9],[325,4,327,4],[325,5,327,5],[325,6,326,7],[325,8,325,11],[325,12,326,13],[388,4,388,5],[388,6,388,7],[263,6,263,7],[263,8,263,9],[263,10,263,11],[263,12,263,13],[263,14,263,15],[323,0,327,0],[323,1,327,1],[323,2,323,11],[324,2,327,2],[324,3,327,3],[259,1,259,3],[260,1,260,3],[263,0,264,0],[263,1,264,1],[263,2,263,3],[263,4,263,5],[252,1,252,3],[253,1,253,3],[254,1,254,3],[255,2,255,3],[256,1,258,1],[256,2,256,3],[257,2,257,3],[246,1,246,3],[247,2,247,3],[248,1,248,3],[249,2,249,3],[250,1,250,3],[251,2,251,3],[240,1,242,1],[240,2,240,3],[241,2,241,3],[242,2,242,3],[244,1,244,3],[245,2,245,3],[236,10,236,11],[236,12,236,13],[236,14,236,15],[236,16,236,17],[238,1,238,3],[239,1,239,3],[236,0,237,0],[236,1,237,3],[236,4,237,4],[236,5,237,5],[236,6,236,7],[236,8,236,9],[188,8,188,10],[189,8,189,10],[190,8,190,10],[192,0,193,0],[192,1,193,1],[192,2,192,3],[192,4,193,4],[192,5,192,9],[170,8,170,10],[172,8,172,10],[177,8,177,10],[182,8,182,10],[186,8,186,10],[187,8,187,10],[166,7,167,7],[166,8,167,10],[166,11,167,11],[166,12,166,13],[166,14,167,14],[166,15,167,15],[166,0,167,0],[166,1,167,1],[166,2,167,2],[166,3,166,4],[166,5,167,5],[166,6,167,6],[111,10,112,11],[112,5,112,6],[119,0,121,0],[119,1,121,1],[119,2,121,2],[119,3,119,5],[119,6,121,6],[120,3,121,3],[120,4,121,4],[120,5,121,5],[110,0,113,0],[110,1,113,1],[110,2,110,8],[110,9,110,11],[111,2,112,2],[111,3,112,4],[111,5,111,6],[111,7,112,7],[111,8,112,8],[111,9,112,9],[104,3,105,3],[104,4,105,4],[104,5,105,5],[95,9,97,9],[95,10,95,11],[96,3,97,3],[96,4,97,4],[96,5,97,5],[96,7,97,7],[96,8,97,8],[96,10,97,10],[96,11,97,11],[18,11,18,15],[449,2,450,2],[449,3,449,4],[82,8,83,8],[95,0,97,0],[95,1,97,1],[95,2,97,2],[95,3,95,5],[95,6,97,6],[95,7,95,8],[81,0,83,0],[81,1,83,1],[81,2,83,2],[81,3,81,5],[81,6,83,6],[81,7,81,8],[82,3,83,3],[82,4,83,4],[82,5,83,5],[82,7,83,7],[103,0,105,0],[103,1,105,1],[103,2,105,2],[103,3,103,5]]}
[" ","Denumirea unitatii",null,null,null,null,"Numele persoanei care raspunde de informatiile inscrise in formular",null,null,null,null,null,null,"Dna/Dl manager/Director",null,null,null,"Persoana care a completat daca are semnatura digitala"]
[null,"For Tutelar",null,null,null,null,"Telefon"]
[null,"Judetul",null,null,null,null,"E- mail"]
[null,"Localitatea"]
[null,"Strada"]
[null,"Nr."]
[null,"Tip spital"]
[null,"Forma juridica"]
[null,"Forma de proprietate"]
[null,"Conducatorul unitatii",null,null,"ATENTIE !"]
[null,"Telefon",null,null,"Pentru colectarea corecta a datelor trebuie sa activati macrourile"]
[null,"Cod unitbz:",null,null,"In File-> Options-> Trust Center-> Trust Center Settings-> Macro settings->se bifeaza Enable VBA Macros se da click pe OK"]
[]
["Activitatea unităţilor sanitare în anul 2024"]
[]
["Cap.1  Numărul unităţilor sanitare și al unităților din sfera asistenței sociale în care se furnizeaza și îngrijiri medicale - la sfârşitul anului"]
["Nr. rând","Tipuri de unităţi sanitare","Total"]
["A","B","1",null,null,null,null,null,null,null,null,"Mesaje de eroare"]
["1.    ","Spitale (inclusiv institute cu paturi de spital)",0,null,null,null,null,null,null,null,null,"Numar mesaje de eroare in sheet SAN",null,null,null,null,0]
["2.    ","Unități sanitare (inclusiv unități asimilate spitalelor) numai cu internare de zi*",0,null,null,null,null,null,null,null,null,"Numar mesaje de eroare in sheet c4",null,null,null,null,0]
["3.    ","Centre de sănătate cu paturi de spital",0,null,null,null,null,null,null,null,null,"Numar mesaje de eroare in sheet c2Sp_Sext_cab_spital",null,null,null,null,0]
["4.    ","Centre de sănătate",0,null,null,null,null,null,null,null,null,"Numar mesaje de eroare in sheet c2Sp_Sext_cab_ambulator",null,null,null,null,0]
["5.    ","Centre de sănătate multifuncționale",0,null,null,null,null,null,null,null,null,"Numar mesaje de eroare in sheet c2Amb_spec",null,null,null,null,0]
["6.    ","Centre de sănătate mintală",0,null,null,null,null,null,null,null,null,"Numar mesaje de eroare in sheet c3tbcSp_Sext",null,null,null,null,0]
["7.    ","Unităţi medico-sociale",0,null,null,null,null,null,null,null,null,"Numar mesaje de eroare in sheet c7",null,null,null,null,0]
["8.    ","Sanatorii TBC",0,null,null,null,null,null,null,null,null,"Numar mesaje de eroare in sheet c14",null,null,null,null,0]
["9.    ","Preventorii",0,null,null,null,null,null,null,null,null,"Numar mesaje de eroare in sheet c15",null,null,null,null,0]
["10.    ","Sanatorii de nevroze sau de neuropsihiatrie",0,null,null,null,null,null,null,null,null,"Numar mesaje de eroare in sheet c10",null,null,null,null,0]
["11.   ","Sanatorii balneare ",0,null,null,null,null," ",null,null,null,"Numar mesaje de eroare in sheet IAAM",null,null,null,null,0]
["12.   ","Dispensare medicale ",0,null,null,null,null,null,null,null,null,"Numar mesaje de eroare in sheet Transfuzii",null,null,null,null,0]
["13.   ","Cabinete medicale şcolare ",0,null,null,null,null,null,null,null,null,"Numar mesaje de eroare in sheet Laboratoare_Sali_operatie",null,null,null,null,0]
["14.   ","Cabinete medicale studenţeşti",0]
["15.   ","Cabinete independente de medicină generală",0]
["16.   ","Cabinete independente de medicină de familie 1)  ",0]
["17.   ","Societăţi medicale civile 2)",0]
["18.   ","Farmacii",0]
["19.   ","Puncte de lucru ale farmaciilor",0]
["20.   ","Drogherii",0]
["21.   ","Depozite farmaceutice",0]
["22.   ","Policlinici",0]
["23.   ","Centre de dializă",0]
["24.   ","Puncte de lucru ale centrelor de dializă",0]
["25.   ","Centre de diagnostic şi tratament 3)",0]
["26.   ","Centre medicale de specialitate 2)",0]
["27.   ","Ambulatorii de specialitate 2)",0]
["28.   ","Ambulatorii integrate spitalului 4)",0]
["29.   ","Cabinete stomatologice şcolare ",0]
["30.   ","Cabinete stomatologice studenţeşti",0]
["31.   ","Cabinete stomatologice independente 1)",0]
["32.   ","Societăţi stomatologice civile medicale 1)",0]
["33.   ","Cabinete medicale independente de specialitate 1) ",0]
["34.   ","Societăţi civile medicale de specialitate 1)",0]
["35.   ","Centre de transfuzie sanguină",0]
["36.   ","Laboratoare medicale",{"$f":"+Laboratoare_sali_operatie!C5","v":0}]
["37.   ","Laboratoare de tehnică dentară",0]
["38.   ","Unități de ambulanță, transportul pacienților și SMURD",0]
["39.   ","Alte tipuri de cabinete medicale",0]
["40.   ","Unitati rezidentiale pentru persoanele cu dizabilități",0]
["41.   ","Centre de zi pentru persoanele cu dizabilități",0]
["42.   ","Unități rezidențiale pentru persoanele vârstnice care oferă îngriji medicale în cadrul unității",0]
["43.   ","Alte unități de asistență socială care furnizează îngrijiri medicale",0]
["44.   ","Institute şi instituţii fără paturi",0]
["Cap.2  Numărul cabinetelor medicale și al săliilor de operații care funcţionează în structura unor unități sanitare"]
["Nr. rând","Tipuri de unităţi sanitare","Cabinete de medicină generală","Cabinete medicină de familie","Cabinete Stomatologice","Cabinete medicale de specialitate","Săli de operații"]
["A","B",1,2,3,4,5]
["1.","Spitale (inclusiv institute cu paturi de spital)",0,0,{"$f":"+'c2Sp_Sext_cab_spital'!AG19+'c2Sp_Sext_cab_spital'!I42","v":0},{"$f":"+'c2Sp_Sext_cab_spital'!C19-'c2Sp_Sext_cab_spital'!AG19","v":0},{"$f":"+Laboratoare_sali_operatie!C34","v":0}]
["2.","Unități sanitare (inclusiv unități asimilate spitalelor) numai cu internare de zi*",0,0,0,0,0]
["3.","Centre de sănătate cu paturi de spital",0,0,0,0,0]
["4.","Centre de sănătate",0,0,0,0,0]
["5.","Centre de sănătate multifuncționale",0,0,0,0,0]
["6.","Centre de sănătate mintală",0,0,0,{"$f":"+'c2Sp_Sext_cab_ambulator'!AH19","v":0},0]
["7.","Societăţi medicale civile",0,0,0,0,0]
["8.","Policlinici",0,0,0,0,0]
["9.","Centre de dializă și puncte ale centrelor de dializă",0,0,0,0,0]
["10.","Centre de diagnostic şi tratament",0,0,0,0,0]
["11.","Centre medicale de specialitate",0,0,0,0,0]
["12.","Ambulatorii de specialitate",0,0,{"$f":"'c2Amb_spec'!AH19","v":0},{"$f":"+'c2Amb_spec'!D19-'c2Amb_spec'!AH19","v":0},0]
["13.","Ambulatorii integrate spitalelor",0,0,{"$f":"+'c2Sp_Sext_cab_ambulator'!AG19+'c3tbcSp_Sext'!J58","v":0},{"$f":"+'c2Sp_Sext_cab_ambulator'!C19+'c3tbcSp_Sext'!B58-'c2Sp_Sext_cab_ambulator'!AG19-'c2Sp_Sext_cab_ambulator'!AH19","v":0},0]
["14.","Societăţi stomatologice civile medicale",0,0,0,0,0]
["15.","Societăţi civile medicale de specialitate",0,0,0,0,0]
["Cap.3a  Numărul paturilor si al pacienţilor internati în unităţile sanitare"]
["Nr. rând","Tipuri de unităţi sanitare","Paturi pentru spitalizare continuă","Pacienți internaţi în regim continuu",null,null,"Paturi pt. cazuri de zi","Numărul cazurilor de zi"]
[null,null,null,"Total","d.c: femei","Om-zile  spitalizare",null,"Total","d.c: femei"]
[]
["A","B",1,2,3,4,5,6,7]
["1.    ","Spitale (inclusiv institute cu paturi de spital)",{"$f":"+'c2Sp_Sext_cab_spital'!E130+'c2Sp_Sext_cab_spital'!F130+'c3tbcSp_Sext'!E137+'c3tbcSp_Sext'!F137","v":0},{"$f":"+'c2Sp_Sext_cab_spital'!H130+'c2Sp_Sext_cab_spital'!I130+'c3tbcSp_Sext'!H137+'c3tbcSp_Sext'!I137","v":0},0,{"$f":"+'c2Sp_Sext_cab_spital'!Q130+'c3tbcSp_Sext'!Q137","v":0},0,0,0]
["2.    ","Unități sanitare (inclusiv unități asimilate spitalelor) numai cu internare de zi*",0,0,0,0,0,0,0]
["3.    ","Centre de sănătate cu paturi de spital",0,0,0,0,0,0,0]
["4.    ","Centre de sănătate multifuncționale",0,0,0,0,0,0,0]
["5.    ","Unităţi medico-sociale",0,0,0,0,0,0,0]
["6.    ","Sanatorii TBC",0,0,0,0,0,0,0]
["7.    ","Preventorii",{"$f":"+'c4'!B18+'c4'!C18","v":0},{"$f":"+'c4'!E18+'c4'!F18","v":0},0,{"$f":"+'c4'!K18","v":0}]
["8.    ","Sanatorii de nevroze sau de neuropsihiatrie",0,0,0,0]
["9.    ","Sanatorii balneare ",0,0,0,0]
["Cap.3b  Numărul paturilor aferente posturilor de dializă și al pacienților tratați în centrele de dializă și în punctele de lucru ale centrelor de dializă"]
["Nr. rând","Tipuri de unităţi sanitare","Posturi \n/aparate de dializă pentru spitalizare continuă","Pacienți dializați internați în regim continuu",null,null,"Paturi aferente posturilor de dializă pentru cazuri de zi","Numărul cazurilor de zi",null,"Paturi aferente posturilor de dializă pentru servicii ambulatorii","Numărul cazurilor de zi"]
[null,null,null,"Total","d.c: femei","Număr ședințe",null,"Total","d.c: femei",null,"Total","d.c: femei"]
[]
["A","B",1,2,3,4,5,6,7,8,9,10]
["1.    ","Centre de dializă",0,0,0,0,0,0,0,0,0,0]
["2.    ","Puncte de lucru ale centrelor de dializă",0,0,0,0,0,0,0,0,0,0]
["3.    ","Stații de dializă",0,0,0,0,0,0,0,0,0,0]
["Cap.3c  Numărul paturilor și al persoanelor rezidente in unitățile rezidențiale pentru persoanele cu dizabilități sau pentru persoanele vârstnice în care se furnizează îngrijire medicală împreună cu îngrijire socială"]
["Nr. rând","Tipuri de unităţi sanitare","Paturi pentru persoane rezidente în unitate","Persoane rezidente"]
[null,null,null,"Total","d.c: femei","Om-zile  internare în unitatea rezidențială"]
[]
["A","B",1,2,3,4]
["1.    ","Unități rezidențiale pentru persoanele cu dizabilități",0,0,0,0]
["2.    ","Unități rezidențiale pentru persoanele vârstnice care oferă îngriji medicale în cadrul unității",0,0,0,0]
["Cap.3d Activitatea compartimentelor de terapie intensivă (TI) din spitale și unități sanitare numai cu internare de zi"]
["'Nr. rând","Tipuri de unităţi ","Paturi de terapie intensivă (TI)",null,null,null,null,null,null,"Utilizare paturi de terapie intensivă (TI)"]
[null,null,"Total paturi TI","Total paturi TI adulți",null,"din care:",null,"Total paturi TI neonatologie","Total paturi TI pediatrie","Om-zile spitalizare adulți în TI","Număr de zile cu rata de ocupare a paturilor TI pentru adulți peste***"]
[null,null,null,null,null,"paturi TI pentru îngrijire critică adulți"]
[null,null,"la 31 decembrie*","la 31 decembrie*","număr maxim (zilnic)**","la 31 decembrie*","număr maxim (zilnic)**","la 31 decembrie*","la 31 decembrie*","Total la sfârșitul anului","80%","95%"]
["A","B",1,2,3,4,5,6,7,8,9,10]
["1.","Spitale (inclusiv institute cu paturi de spital) ",{"$f":"+D116+H116+I116","v":0},0,0,0,0,0,0,0,0,0]
["2.","Unități sanitare (inclusiv unități asimilate spitalelor) numai cu internare de zi ",{"$f":"+D117+H117+I117","v":0},0,0,0,0,0,0,0,0,0]
[]
["Cap.4  Numărul paturilor în unități sanitare (exclusiv paturile din unitățile pt. persoanele cu dizabilități și pt. persoanele vârsnice), pe specialităţi "]
["Nr. rând","Specialităţi medicale","Total paturi pentru spitalizare continuă","Din total, paturi pentru spitalizare continuă",null,null,"Paturi pentru cazuri de zi"]
[null,null,null,"Paturi pentru copii","Paturi \nClinice","Paturi pentru bolnavi cronici"]
[]
["A","B","1",2,3,4,5]
["1.    ","TOTAL, din care:",{"$f":"SUM(C125:C165)-C126-C129-C136-C142-C145-C147-C148-C150-C151-C157","v":0},{"$f":"SUM(D125:D165)-D126-D129-D136-D142-D145-D147-D148-D150-D151-D157","v":0},0,0,0,{"$f":"IF((C86+C88+C91+C92+C93+C94)=(C124),\"OK\",\"Err\")","v":"OK"},{"$f":"IF((G86+G87+G88+G89+G91)=(G124),\"OK\",\"Err\")","v":"OK"}]
["2.    ","Interne, din care:",0,0,0,0,0]
["3.    ","     - pneumologie netuberculoasă",0,0,0,0,0]
["4.    ","Nefrologie",0,0,0,0,0]
["5.    ","Boli infecţioase, din care:",0,0,0,0,0,null,null,null,null," "]
["6.    ","     - HIV/SIDA",0,0,0,0,0]
["7.    ","Boli profesionale",0,0,0,0,0]
["8.    ","Cardiologie",0,0,0,0,0]
["9.   ","Cronici",0,0,0,0,0,{"$f":"IF(C132=F132,\"OK\",\"Err\")","v":"OK"}]
["10.   ","Dermato-venerologie",0,0,0,0,0]
["11.   ","Diabet zaharat, nutriţie şi boli metabolice",0,0,0,0,0]
["12.   ","Endocrinologie, din care:",0,0,0,0,0]
["13.   ","      - chirurgie endocrină",0,0,0,0,0]
["14.   ","Gastroenterologie",0,0,0,0,0]
["15.   ","Geriatrie şi gerontologie",0,0,0,0,0,{"$f":"IF(C138=F138,\"OK\",\"Err\")","v":"OK"}]
["16.   ","Hematologie",0,0,0,0,0]
["17.   ","Medicină generală",0,0,0,0,0]
["18.   ","Neonatologie, din care:",0,0,0,0,0,{"$f":"IF(C141=D141,\"OK\",\"Err\")","v":"OK"}]
["19.   ","     - prematuri",0,0,0,0,0,{"$f":"IF(C142=D142,\"OK\",\"Err\")","v":"OK"},{"$f":"IF(C142=F142,\"OK\",\"Err\")","v":"OK"}]
["20.   ","Neurologie",0,0,0,0,0]
["21.   ","Oncologie, din care:",0,0,0,0,0]
["22.   ","    -chirurgie oncologică",0,0,0,0,0]
["23.   ","Pediatrie, din care:",0,0,0,0,0,{"$f":"IF(C146=D146,\"OK\",\"Err\")","v":"OK"}]
["24.   ","    - recuperare pediatrică",0,0,0,0,0,{"$f":"IF(C147=D147,\"OK\",\"Err\")","v":"OK"},{"$f":"IF(C147=F147,\"OK\",\"Err\")","v":"OK"}]
["25.   ","    - pneumologie netuberculoasă",0,0,0,0,0]
["26.   ","Pneumologie, din care:",0,0,0,0,0]
["27.   ","     - pneumologie -TBC",0,0,0,0,0,{"$f":"IF(C150=F150,\"OK\",\"Err\")","v":"OK"}]
["28.   ","     - chirurgie toracică",0,0,0,0,0]
["29.   ","Psihiatrie",0,0,0,0,0]
["30.   ","Recuperare medicală fizică şi balneologie",0,0,0,0,0]
["31.   ","Recuperare neuro-psiho-motorie",0,0,0,0,0]
["32.   ","Reumatologie",0,0,0,0,0]
["33.   ","Chirurgie, din care:",0,0,0,0,0]
["34.   "," - chirurgie orală și maxilo-facială",0,0,0,0,0]
["35.   ","Neurochirurgie",0,0,0,0,0]
["36.   ","Obstetrică-ginecologie",0,0,0,0,0]
["37.   ","Oftalmologie",0,0,0,0,0]
["38.   ","ORL",0,0,0,0,0]
["39.   ","Ortopedie-traumatologie",0,0,0,0,0]
["40.   ","Urologie",0,0,0,0,0]
["41.   ","ATI (anestezie, terapie intensivă)",0,0,0,0,0]
["42.   ","Alte secţii",0,0,0,0,0]
["Cap.5  Numărul consultaţiilor ambulatorii acordate pacienţilor în unităţile sanitare și în unitățile din sfera asistenței sociale în care se furnizează și îngrijiri medicale și prin servicii de telemedicină"]
["Nr. Crt.","Tipuri de unităţi sanitare","Total consultaţii","din care, după domiciliul pacientului",null,"din col.1: consultatii platite de angajatori pt. personalul propriu","din col.1: tele-medicină","Nr.                            Crt.","Tipuri de unităţi sanitare",null,null,"Total consultaţii"," după domiciliul pacientului",null,"din col.1: consultatii platite de angajatori pt. personalul propriu","din col.1: tele-medicină"]
[null,null,null,"Urban","Rural",null,null,null,null,null,null,null,"Urban","Rural"]
["A","B","1","2","3",4,5,"A","B",null,null,"1","2","3",4,5]
[1,"TOTAL, din care:",{"$f":"SUM(D170:E170)","v":0},{"$f":"+D171+D174+D176+SUM(D178:D180)-D179+SUM(D181:D190)+SUM(M170:M171)+M173+M175+M177+SUM(M179:M190)","v":0},{"$f":"+E171+E174+E176+SUM(E178:E180)-E179+SUM(E181:E190)+SUM(N170:N171)+N173+N175+N177+SUM(N179:N190)","v":0},0,0,22,"Puncte de lucru ale centrelor de dializă",null,null,{"$f":"SUM(M170:N170)","v":0},0,0,0,0]
[2,"Spitale (inclusiv institute cu paturi de spital), din care:",{"$f":"+D171+E171","v":0},{"$f":"+D172+D173+'c3tbcSp_Sext'!B56+'c2Sp_Sext_cab_spital'!C15+'c2Sp_Sext_cab_spital'!C16-'c2Sp_Sext_cab_spital'!AG15-'c2Sp_Sext_cab_spital'!AG16-'c2Sp_Sext_cab_spital'!AH15-'c2Sp_Sext_cab_spital'!AH16+'c10'!B26","v":0},{"$f":"+E172+E173+'c3tbcSp_Sext'!D56+'c2Sp_Sext_cab_spital'!C17+'c2Sp_Sext_cab_spital'!C18-'c2Sp_Sext_cab_spital'!AG17-'c2Sp_Sext_cab_spital'!AG18-'c2Sp_Sext_cab_spital'!AH17-'c2Sp_Sext_cab_spital'!AH18+'c10'!C26","v":0},0,0,23,"Centre de diagnostic şi tratament,                 din care:",null,null,{"$f":"+M171+N171","v":0},0,0,0,0]
[3,"      - în camera de gardă şi UPU",{"$f":"+D172+E172","v":0},{"$f":"+'c2Sp_Sext_cab_spital'!D35+'c3tbcSp_Sext'!B57","v":0},{"$f":"+'c2Sp_Sext_cab_spital'!E35+'c3tbcSp_Sext'!D57","v":0},0,0,24,"      - în cabinete stomatologice",null,null,{"$f":"SUM(M172:N172)","v":0},0,0,0,0]
[4,"      - în cabinete stomatologice",{"$f":"+D173+E173","v":0},{"$f":"+'c2Sp_Sext_cab_spital'!AG15+'c2Sp_Sext_cab_spital'!AG16+'c2Sp_Sext_cab_spital'!J35+'c3tbcSp_Sext'!J56+'c3tbcSp_Sext'!J57","v":0},{"$f":"+'c2Sp_Sext_cab_spital'!AG17+'c2Sp_Sext_cab_spital'!AG18+'c2Sp_Sext_cab_spital'!K35+'c3tbcSp_Sext'!L56+'c3tbcSp_Sext'!L57","v":0},0,0,25,"Centre medicale de specialitate, din care:",null,null,{"$f":"SUM(M173:N173)","v":0},0,0,0,0]
[5,"Unități sanitare (inclusiv unități asimilate spitalelor) numai cu internare de zi*, din care:",0,0,0,0,0,26,"      - în cabinete stomatologice",null,null,{"$f":"SUM(M174:N174)","v":0},0,0,0,0]
[6,"      - în cabinete stomatologice",0,0,0,0,0,27,"Ambulatorii de  specialitate, din care:",null,null,0,{"$f":"+'c2Amb_spec'!D15+'c2Amb_spec'!D16","v":0},{"$f":"+'c2Amb_spec'!D17+'c2Amb_spec'!D18","v":0},0,0]
[7,"Centre de sănătate cu paturi de spital, din care:",0,0,0,0,0,28,"      - în cabinete stomatologice",null,null,0,{"$f":"+'c2Amb_spec'!AH15+'c2Amb_spec'!AH16","v":0},{"$f":"+'c2Amb_spec'!AH17+'c2Amb_spec'!AH18","v":0},0,0]
[8,"      - în cabinete stomatologice",0,0,0,0,0,29,"Ambulatorii integrate spitalului, din care:",null,null,0,{"$f":"+M178+'c2Sp_Sext_cab_ambulator'!C15+'c2Sp_Sext_cab_ambulator'!C16-'c2Sp_Sext_cab_ambulator'!AH15-'c2Sp_Sext_cab_ambulator'!AH16-'c2Sp_Sext_cab_ambulator'!AG15-'c2Sp_Sext_cab_ambulator'!AG16+'c3tbcSp_Sext'!B55","v":0},{"$f":"+N178+'c2Sp_Sext_cab_ambulator'!C17+'c2Sp_Sext_cab_ambulator'!C18-'c2Sp_Sext_cab_ambulator'!AH17-'c2Sp_Sext_cab_ambulator'!AH18-'c2Sp_Sext_cab_ambulator'!AG17-'c2Sp_Sext_cab_ambulator'!AG18+'c3tbcSp_Sext'!D55","v":0},0,0]
[9,"Centre de sănătate, din care:",0,0,0,0,0,30,"      - în cabinete stomatologice",null,null,0,{"$f":"+'c2Sp_Sext_cab_ambulator'!AG15+'c2Sp_Sext_cab_ambulator'!AG16+'c3tbcSp_Sext'!J55","v":0},{"$f":"+'c2Sp_Sext_cab_ambulator'!AG17+'c2Sp_Sext_cab_ambulator'!AG18+'c3tbcSp_Sext'!L55","v":0},0,0]
[10,"      - în cabinete stomatologice",0,0,0,0,0,31,"Cabinete stomatologice şcolare ",null,null,0,0,0,0,0]
[11,"Centre de sănătate multifuncționale",0,null,0,0,0,32,"Cabinete stomatologice studenţeşti",null,null,0,0,0,0,0]
[12,"Centre de sănătate mintală",0,{"$f":"+'c2Sp_Sext_cab_ambulator'!AH15+'c2Sp_Sext_cab_ambulator'!AH16","v":0},{"$f":"+'c2Sp_Sext_cab_ambulator'!AH17+'c2Sp_Sext_cab_ambulator'!AH18","v":0},0,0,33,"Cabinete stomatologice independente",null,null,0,0,0,0,0]
[13,"Sanatorii balneare",0,0,0,0,0,34,"Societăţi stomatologice civile medicale",null,null,0,0,0,0,0]
[14,"Dispensare medicale ",0,{"$f":"+'c3tbcSp_Sext'!B54","v":0},{"$f":"+'c3tbcSp_Sext'!D54","v":0},0,0,35,"Cabinete medicale independente de specialitate",null,null,0,0,0,0,0]
[15,"Cabinete medicale şcolare ",0,0,0,0,0,36,"Societăţi civile medicale de specialitate",null,null,0,0,0,0,0]
[16,"Cabinete medicale studenţeşti",0,0,0,0,0,37,"Centre de transfuzie sanguină",null,null,0,0,0,0,0]
[17,"Cabinete independente de medicină generală",0,0,0,0,0,38,"Alte tipuri de cabinete medicale",null,null,{"$f":"SUM(M186:N186)","v":0},0,0,0,0]
[18,"Cabinete independente de medicină de familie",0,{"$f":"'c1'!E15+'c1'!E16","v":0},{"$f":"'c1'!E18+'c1'!E19","v":0},0,0,39,"Unități rezidențiale pentru persoanele cu dizabilități",null,null,0,0,0,0,0]
[19,"Societăţi medicale civile ",0,{"$f":"'c1'!E30+'c1'!E31","v":0},{"$f":"'c1'!E33+'c1'!E34","v":0},0,0,40,"Unități rezidențiale pentru persoanele vârstnice care oferă îngriji medicale în cadrul unității",null,null,0,0,0,0,0]
[20,"Policlinici",0,0,0,0,0,41,"Alte unități de asistență socială care furnizează îngrijiri medicale",null,null,{"$f":"+SUM(M189:N189)","v":0},0,0,0,0]
[21,"Centre de dializă",0,0,0,0,0,42,"Institute și instituții fără paturi *",null,null,{"$f":"+SUM(M190:N190)","v":0},0,0,0,0]
[]
["Cap.10  Dotarea unităţilor sanitare cu echipamente medicale cu tehnologie avansată și utilizarea acestora (examinări medicale)"]
["Nr. Crt.","Tipuri de unităţi sanitare","Aparate (scannere)  pt:",null,"Aparate          Gamma**","                                                                      Aparate pt:"]
[null,null,"tomografie computerizată       (aparate TC)","tomografie cu emisie de pozitroni (aparate PET)",null,"rezonanţă magnetică (aparate RMN)","angiografie digitală      (aparate DSA)","mărunţirea calculilor renali –litotritor   (aparate LSI)","terapie cu radiaţii          (aparate RAD)"," mamografe"]
["A","B","1","2","3","4","5","6","7",8]
["1.    ","ECHIPAMENTE - Total, din care:",{"$f":"SUM(C197:C215)","v":0},0,0,0,0,0,0,0]
["2.    ","Spitale (inclusiv institute cu paturi de spital)",0,0,0,0,0,0,0,0]
["3.    ","Unități sanitare (inclusiv unități asimilate spitalelor) numai cu internare de zi*",0,0,0,0,0,0,0,0]
["4.    ","Centre de sănătate cu paturi de spital",0,0,0,0,0,0,0,0]
["5.    ","Centre de sănătate",0,0,0,0,0,0,0,0]
["6.    ","Dispensare medicale ",0,0,0,0,0,0,0,0]
["7.    ","Cabinete independente de medicină de familie",0,0,0,0,0,0,0,0]
["8.    ","Societăţi medicale civile ",0,0,0,0,0,0,0,0]
["9.    ","Policlinici",0,0,0,0,0,0,0,0]
["10.    ","Centre de dializă și puncte ale centrelor de dializă",0,0,0,0,0,0,0,0]
["11.    ","Centre de diagnostic şi tratament ",0,0,0,0,0,0,0,0]
["12.    ","Centre medicale de specialitate ",0,0,0,0,0,0,0,0]
["13.    ","Ambulatorii de specialitate ",0,0,0,0,0,0,0,0]
["14.    ","Ambulatorii integrate spitalului ",0,0,0,0,0,0,0,0]
["15.    ","Cabinete stomatologice independente",0,0,0,0,0,0,0,0]
["16.    ","Societăţi stomatologice civile medicale ",0,0,0,0,0,0,0,0]
["17.    ","Cabinete medicale independente de specialitate ",0,0,0,0,0,0,0,0]
["18.    ","Societăţi civile medicale de specialitate",0,0,0,0,0,0,0,0]
["19.    ","Alte tipuri de cabinete medicale 1)",0,0,0,0,0,0,0,0]
["20.    ","Laboratoare medicale",0,0,0,0,0,0,0,0]
["21.    ","EXAMINĂRI - Total, din care:",{"$f":"+SUM(C217:C235)","v":0},0,0,0,0,0,0,0]
["22.    ","Spitale (inclusiv institute cu paturi de spital)",0,0,0,0,0,0,0,0]
["23.    ","Unități sanitare (inclusiv unități asimilate spitalelor) numai cu internare de zi*",0,0,0,0,0,0,0,0]
["24.    ","Centre de sănătate cu paturi de spital",0,0,0,0,0,0,0,0]
["25.    ","Centre de sănătate",0,0,0,0,0,0,0,0]
["26.    ","Dispensare medicale ",0,0,0,0,0,0,0,0]
["27.    ","Cabinete independente de medicină de familie",0,0,0,0,0,0,0,0]
["28.    ","Societăţi medicale civile ",0,0,0,0,0,0,0,0]
["29.    ","Policlinici",0,0,0,0,0,0,0,0]
["30.    ","Centre de dializă și puncte ale centrelor de dializă",0,0,0,0,0,0,0,0]
["31.    ","Centre de diagnostic şi tratament ",0,0,0,0,0,0,0,0]
["32.    ","Centre medicale de specialitate ",0,0,0,0,0,0,0,0]
["33.    ","Ambulatorii de specialitate ",0,0,0,0,0,0,0,0]
["34.    ","Ambulatorii integrate spitalului ",0,0,0,0,0,0,0,0]
["35.    ","Cabinete stomatologice independente",0,0,0,0,0,0,0,0]
["36.    ","Societăţi stomatologice civile medicale ",0,0,0,0,0,0,0,0]
["37.    ","Cabinete medicale independente de specialitate ",0,0,0,0,0,0,0,0]
["38.    ","Societăţi civile medicale de specialitate",0,0,0,0,0,0,0,0]
["39.    ","Alte tipuri de cabinete medicale 1)",0,0,0,0,0,0,0,0]
["40.    ","Laboratoare medicale",0,0,0,0,0,0,0,0]
["Cap.6 Nr.personalului existent la sf.anului in unitatile sanitare și în unitățile din sfera asistenței sociale în care se furnizează și îngrijiri medicale, pe grupe de vârstă"]
["Nr. rand","Categorii de personal sanitar",null,null,"Total","din care: femei","Sub 25 ",null,"25-34 ani",null,"35-44 ani",null,"45-54 ani",null,"55-64 ",null,"65 ani şi peste"]
[null,null,null,null,null,null,"Total","d.c: femei","Total","d.c: femei","Total","d.c: femei","Total","d.c: femei","Total","d.c: femei","Total","d.c: femei"]
["A","B",null,null,"1","2","3","4","5","6","7","8","9","10","11","12","13","14"]
[1,"Medici (exclusiv stomatologi)",null,null,{"$f":"G240+I240+K240+M240+O240+Q240","v":0},{"$f":"H240+J240+L240+N240+P240+R240","v":0},{"$f":"+'c15'!G193","v":0},{"$f":"+'c15'!I193","v":0},{"$f":"+'c15'!J193","v":0},{"$f":"+'c15'!L193","v":0},{"$f":"+'c15'!M193","v":0},{"$f":"+'c15'!O193","v":0},{"$f":"+'c15'!P193","v":0},{"$f":"+'c15'!R193","v":0},{"$f":"+'c15'!S193","v":0},{"$f":"+'c15'!U193","v":0},{"$f":"+'c15'!V193","v":0},{"$f":"+'c15'!X193","v":0}]
[2,"din rd.1","medici de familie",null,{"$f":"G241+I241+K241+M241+O241+Q241","v":0},0,{"$f":"+'c15'!G208","v":0},{"$f":"+'c15'!I208","v":0},{"$f":"+'c15'!J208","v":0},{"$f":"+'c15'!L208","v":0},{"$f":"+'c15'!M208","v":0},{"$f":"+'c15'!O208","v":0},{"$f":"+'c15'!P208","v":0},{"$f":"+'c15'!R208","v":0},{"$f":"+'c15'!S208","v":0},{"$f":"+'c15'!U208","v":0},{"$f":"+'c15'!V208","v":0},{"$f":"+'c15'!X208","v":0}]
[3,null,"medici de chirurgie orală și maxilo-facilă",null,0,0,{"$f":"+'c15'!G229","v":0},{"$f":"+'c15'!I229","v":0},{"$f":"+'c15'!J229","v":0},{"$f":"+'c15'!L229","v":0},{"$f":"+'c15'!M229","v":0},{"$f":"+'c15'!O229","v":0},{"$f":"+'c15'!P229","v":0},{"$f":"+'c15'!R229","v":0},{"$f":"+'c15'!S229","v":0},{"$f":"+'c15'!U229","v":0},{"$f":"+'c15'!V229","v":0},{"$f":"+'c15'!X229","v":0}]
[4,null,"medici rezidenţi",null,0,0,{"$f":"+'c15'!G194","v":0},{"$f":"+'c15'!I194","v":0},{"$f":"+'c15'!J194","v":0},{"$f":"+'c15'!L194","v":0},{"$f":"+'c15'!M194","v":0},{"$f":"+'c15'!O194","v":0},{"$f":"+'c15'!P194","v":0},{"$f":"+'c15'!R194","v":0},{"$f":"+'c15'!S194","v":0},{"$f":"+'c15'!U194","v":0},{"$f":"+'c15'!V194","v":0},{"$f":"+'c15'!X194","v":0}]
[5,null,"din rd.4","rezidenţi chirurgie orală și maxilo-facilă",0,0,{"$f":"+'c15'!G230","v":0},{"$f":"+'c15'!I230","v":0},{"$f":"+'c15'!J230","v":0},{"$f":"+'c15'!L230","v":0},{"$f":"+'c15'!M230","v":0},{"$f":"+'c15'!O230","v":0},{"$f":"+'c15'!P230","v":0},{"$f":"+'c15'!R230","v":0},{"$f":"+'c15'!S230","v":0},{"$f":"+'c15'!U230","v":0},{"$f":"+'c15'!V230","v":0},{"$f":"+'c15'!X230","v":0}]
[6,"Medici stomatologi",null,null,0,0,{"$f":"+'c15'!G251","v":0},{"$f":"+'c15'!I251","v":0},{"$f":"+'c15'!J251","v":0},{"$f":"+'c15'!L251","v":0},{"$f":"+'c15'!M251","v":0},{"$f":"+'c15'!O251","v":0},{"$f":"+'c15'!P251","v":0},{"$f":"+'c15'!R251","v":0},{"$f":"+'c15'!S251","v":0},{"$f":"+'c15'!U251","v":0},{"$f":"+'c15'!V251","v":0},{"$f":"+'c15'!X251","v":0}]
[7,"din rd.6","med.stomatologi rezidenţi",null,0,0,{"$f":"+'c15'!G252","v":0},{"$f":"+'c15'!I252","v":0},{"$f":"+'c15'!J252","v":0},{"$f":"+'c15'!L252","v":0},{"$f":"+'c15'!M252","v":0},{"$f":"+'c15'!O252","v":0},{"$f":"+'c15'!P252","v":0},{"$f":"+'c15'!R252","v":0},{"$f":"+'c15'!S252","v":0},{"$f":"+'c15'!U252","v":0},{"$f":"+'c15'!V252","v":0},{"$f":"+'c15'!X252","v":0}]
[8,"Farmacişti",null,null,0,0,{"$f":"+'c15'!G255","v":0},{"$f":"+'c15'!I255","v":0},{"$f":"+'c15'!J255","v":0},{"$f":"+'c15'!L255","v":0},{"$f":"+'c15'!M255","v":0},{"$f":"+'c15'!O255","v":0},{"$f":"+'c15'!P255","v":0},{"$f":"+'c15'!R255","v":0},{"$f":"+'c15'!S255","v":0},{"$f":"+'c15'!U255","v":0},{"$f":"+'c15'!V255","v":0},{"$f":"+'c15'!X255","v":0}]
[9,"din rd.8","farmacişti rezidenţi",null,0,0,{"$f":"+'c15'!G256","v":0},{"$f":"+'c15'!I256","v":0},{"$f":"+'c15'!J256","v":0},{"$f":"+'c15'!L256","v":0},{"$f":"+'c15'!M256","v":0},{"$f":"+'c15'!O256","v":0},{"$f":"+'c15'!P256","v":0},{"$f":"+'c15'!R256","v":0},{"$f":"+'c15'!S256","v":0},{"$f":"+'c15'!U256","v":0},{"$f":"+'c15'!V256","v":0},{"$f":"+'c15'!X256","v":0}]
[10,"Fiziokinetoterapeuţi cu studii superioare",null,null,{"$f":"G249+I249+K249+M249+O249+Q249","v":0},{"$f":"H249+J249+L249+N249+P249+R249","v":0},{"$f":"+'c15'!G259","v":0},{"$f":"+'c15'!I259","v":0},{"$f":"+'c15'!J259","v":0},{"$f":"+'c15'!L259","v":0},{"$f":"+'c15'!M259","v":0},{"$f":"+'c15'!O259","v":0},{"$f":"+'c15'!P259","v":0},{"$f":"+'c15'!R259","v":0},{"$f":"+'c15'!S259","v":0},{"$f":"+'c15'!U259","v":0},{"$f":"+'c15'!V259","v":0},{"$f":"+'c15'!X259","v":0}]
[11,"din rd.10","fizioterapeuti",null,0,0,{"$f":"+'c15'!G260","v":0},{"$f":"+'c15'!I260","v":0},{"$f":"+'c15'!J260","v":0},{"$f":"+'c15'!L260","v":0},{"$f":"+'c15'!M260","v":0},{"$f":"+'c15'!O260","v":0},{"$f":"+'c15'!P260","v":0},{"$f":"+'c15'!R260","v":0},{"$f":"+'c15'!S260","v":0},{"$f":"+'c15'!U260","v":0},{"$f":"+'c15'!V260","v":0},{"$f":"+'c15'!X260","v":0}]
[12,"Asistenti medicali cu studii superioare",null,null,0,0,{"$f":"+'c15'!G261","v":0},{"$f":"+'c15'!I261","v":0},{"$f":"+'c15'!J261","v":0},{"$f":"+'c15'!L261","v":0},{"$f":"+'c15'!M261","v":0},{"$f":"+'c15'!O261","v":0},{"$f":"+'c15'!P261","v":0},{"$f":"+'c15'!R261","v":0},{"$f":"+'c15'!S261","v":0},{"$f":"+'c15'!U261","v":0},{"$f":"+'c15'!V261","v":0},{"$f":"+'c15'!X261","v":0}]
[13,"din rd.12","Moașe",null,0,0,{"$f":"+'c15'!G262","v":0},{"$f":"+'c15'!I262","v":0},{"$f":"+'c15'!J262","v":0},{"$f":"+'c15'!L262","v":0},{"$f":"+'c15'!M262","v":0},{"$f":"+'c15'!O262","v":0},{"$f":"+'c15'!P262","v":0},{"$f":"+'c15'!R262","v":0},{"$f":"+'c15'!S262","v":0},{"$f":"+'c15'!U262","v":0},{"$f":"+'c15'!V262","v":0},{"$f":"+'c15'!X262","v":0}]
[14,"Alt personal sanitar cu  studii superioare ",null,null,0,0,{"$f":"+'c15'!G263","v":0},{"$f":"+'c15'!I263","v":0},{"$f":"+'c15'!J263","v":0},{"$f":"+'c15'!L263","v":0},{"$f":"+'c15'!M263","v":0},{"$f":"+'c15'!O263","v":0},{"$f":"+'c15'!P263","v":0},{"$f":"+'c15'!R263","v":0},{"$f":"+'c15'!S263","v":0},{"$f":"+'c15'!U263","v":0},{"$f":"+'c15'!V263","v":0},{"$f":"+'c15'!X263","v":0}]
[15,"Alt personal cu  studii superioare ",null,null,0,0,{"$f":"+'c15'!G265","v":0},{"$f":"+'c15'!I265","v":0},{"$f":"+'c15'!J265","v":0},{"$f":"+'c15'!L265","v":0},{"$f":"+'c15'!M265","v":0},{"$f":"+'c15'!O265","v":0},{"$f":"+'c15'!P265","v":0},{"$f":"+'c15'!R265","v":0},{"$f":"+'c15'!S265","v":0},{"$f":"+'c15'!U265","v":0},{"$f":"+'c15'!V265","v":0},{"$f":"+'c15'!X265","v":0}]
[16,"Personal sanitar mediu",null,null,0,0,{"$f":"+'c15'!G62","v":0},{"$f":"+'c15'!I62","v":0},{"$f":"+'c15'!J62","v":0},{"$f":"+'c15'!L62","v":0},{"$f":"+'c15'!M62","v":0},{"$f":"+'c15'!O62","v":0},{"$f":"+'c15'!P62","v":0},{"$f":"+'c15'!R62","v":0},{"$f":"+'c15'!S62","v":0},{"$f":"+'c15'!U62","v":0},{"$f":"+'c15'!V62","v":0},{"$f":"+'c15'!X62","v":0}]
[17,"din rd.16","total as.medicali",null,0,0,{"$f":"+'c15'!G63","v":0},{"$f":"+'c15'!I63","v":0},{"$f":"+'c15'!J63","v":0},{"$f":"+'c15'!L63","v":0},{"$f":"+'c15'!M63","v":0},{"$f":"+'c15'!O63","v":0},{"$f":"+'c15'!P63","v":0},{"$f":"+'c15'!R63","v":0},{"$f":"+'c15'!S63","v":0},{"$f":"+'c15'!U63","v":0},{"$f":"+'c15'!V63","v":0},{"$f":"+'c15'!X63","v":0}]
[18,"din rd.17","asistenţi obstetrică-ginecologie (moașe)",null,0,0,{"$f":"+'c15'!G66","v":0},{"$f":"+'c15'!I66","v":0},{"$f":"+'c15'!J66","v":0},{"$f":"+'c15'!L66","v":0},{"$f":"+'c15'!M66","v":0},{"$f":"+'c15'!O66","v":0},{"$f":"+'c15'!P66","v":0},{"$f":"+'c15'!R66","v":0},{"$f":"+'c15'!S66","v":0},{"$f":"+'c15'!U66","v":0},{"$f":"+'c15'!V66","v":0},{"$f":"+'c15'!X66","v":0}]
[19,null,"as.fiziokinetoterapeuţi",null,{"$f":"G258+I258+K258+M258+O258+Q258","v":0},0,{"$f":"+'c15'!G74","v":0},{"$f":"+'c15'!I74","v":0},{"$f":"+'c15'!J74","v":0},{"$f":"+'c15'!L74","v":0},{"$f":"+'c15'!M74","v":0},{"$f":"+'c15'!O74","v":0},{"$f":"+'c15'!P74","v":0},{"$f":"+'c15'!R74","v":0},{"$f":"+'c15'!S74","v":0},{"$f":"+'c15'!U74","v":0},{"$f":"+'c15'!V74","v":0},{"$f":"+'c15'!X74","v":0}]
[20,null,"din rd.19","as. fizioterapeuţi",0,0,{"$f":"+'c15'!G75","v":0},{"$f":"+'c15'!I75","v":0},{"$f":"+'c15'!J75","v":0},{"$f":"+'c15'!L75","v":0},{"$f":"+'c15'!M75","v":0},{"$f":"+'c15'!O75","v":0},{"$f":"+'c15'!P75","v":0},{"$f":"+'c15'!R75","v":0},{"$f":"+'c15'!S75","v":0},{"$f":"+'c15'!U75","v":0},{"$f":"+'c15'!V75","v":0},{"$f":"+'c15'!X75","v":0}]
[21,"Personal sanitar auxiliar",null,null,0,0,{"$f":"+'c15'!G94","v":0},{"$f":"+'c15'!I94","v":0},{"$f":"+'c15'!J94","v":0},{"$f":"+'c15'!L94","v":0},{"$f":"+'c15'!M94","v":0},{"$f":"+'c15'!O94","v":0},{"$f":"+'c15'!P94","v":0},{"$f":"+'c15'!R94","v":0},{"$f":"+'c15'!S94","v":0},{"$f":"+'c15'!U94","v":0},{"$f":"+'c15'!V94","v":0},{"$f":"+'c15'!X94","v":0}]
[22,"Alt personal mediu angajat",null,null,0,0,{"$f":"+'c15'!G95+'c15'!G96+'c15'!G97","v":0},{"$f":"+'c15'!I95+'c15'!I96+'c15'!I97","v":0},{"$f":"+'c15'!J95+'c15'!J96+'c15'!J97","v":0},{"$f":"+'c15'!L95+'c15'!L96+'c15'!L97","v":0},{"$f":"+'c15'!M95+'c15'!M96+'c15'!M97","v":0},{"$f":"+'c15'!O95+'c15'!O96+'c15'!O97","v":0},{"$f":"+'c15'!P95+'c15'!P96+'c15'!P97","v":0},{"$f":"+'c15'!R95+'c15'!R96+'c15'!R97","v":0},{"$f":"+'c15'!S95+'c15'!S96+'c15'!S97","v":0},{"$f":"+'c15'!U95+'c15'!U96+'c15'!U97","v":0},{"$f":"+'c15'!V95+'c15'!V96+'c15'!V97","v":0},{"$f":"+'c15'!X95+'c15'!X96+'c15'!X97","v":0}]
["Cap.7  Numărul personalului cu studii superioare, existent la sfârşitul anului, pe tipuri de unităţi sanitare și pe unități din sfera asistenței sociale în care se furnizează și îngrijiri medicale"]
[null,null,{"$f":"IF(C267=E240,\"OK\",\"Err\")","v":"OK"},{"$f":"IF(D267=F240,\"OK\",\"Err\")","v":"OK"},{"$f":"IF(E267=E245,\"OK\",\"Err\")","v":"OK"},{"$f":"IF(F267=F245,\"OK\",\"Err\")","v":"OK"},{"$f":"IF(G267=E247,\"OK\",\"Err\")","v":"OK"},{"$f":"IF(H267=F247,\"OK\",\"Err\")","v":"OK"},{"$f":"IF(I267=E249,\"OK\",\"Err\")","v":"OK"},{"$f":"IF(J267=F249,\"OK\",\"Err\")","v":"OK"},{"$f":"IF(K267=E250,\"OK\",\"Err\")","v":"OK"},{"$f":"IF(L267=F250,\"OK\",\"Err\")","v":"OK"},{"$f":"IF(M267=E251,\"OK\",\"Err\")","v":"OK"},{"$f":"IF(N267=F251,\"OK\",\"Err\")","v":"OK"},{"$f":"IF(O267=E252,\"OK\",\"Err\")","v":"OK"},{"$f":"IF(P267=F252,\"OK\",\"Err\")","v":"OK"},{"$f":"IF(Q267=E253,\"OK\",\"Err\")","v":"OK"},{"$f":"IF(R267=F253,\"OK\",\"Err\")","v":"OK"},{"$f":"IF(S267=E254,\"OK\",\"Err\")","v":"OK"},{"$f":"IF(T267=F254,\"OK\",\"Err\")","v":"OK"}]
["Nr. Crt.","Tipuri de unităţi sanitare","Medici (exclusiv stomatologi)",null,"Medici stomatologi",null,"Farmacişti",null,"Fiziokinetoterapeuţi",null,"din care: Fizioterapeuţi",null,"As.med. (cu std.sup.)",null," din care: moaşe",null,"Alt personal sanitar        (cu stud.super)",null,"Alt personal cu studii superioare"]
[null,null,"Total ","d.c: femei","Total ","d.c: femei","Total ","d.c: femei","Total ","d.c: femei","Total ","d.c: femei","Total ","d.c: femei","Total ","d.c: femei","Total ","d.c: femei","Total ","d.c: femei"]
["A","B","1","2","3","4","5","6","7","8","9","10","11","12","13","14",15,16,17,18]
[1,"Total, personal cu studii superioare",{"$f":"SUM(C269:C322)-C270-C272-C274-C277-C280-C282-C284-C286-C288-C301","v":0},{"$f":"SUM(D269:D322)-D270-D272-D274-D277-D280-D282-D284-D286-D288-D301","v":0},0,0,0,0,0,0,0,0,0,0,0,0,0,0,0,0]
[2," - din care: cu normă întreagă",{"$f":"+'c15'!Y193","v":0},{"$f":"+'c15'!AA193","v":0},{"$f":"+'c15'!Y251","v":0},{"$f":"+'c15'!AA251","v":0},{"$f":"+'c15'!Y255","v":0},{"$f":"+'c15'!AA255","v":0},{"$f":"+'c15'!Y259","v":0},{"$f":"+'c15'!AA259","v":0},{"$f":"+'c15'!Y260","v":0},{"$f":"+'c15'!AA260","v":0},{"$f":"+'c15'!Y261","v":0},{"$f":"+'c15'!AA261","v":0},{"$f":"+'c15'!Y262","v":0},{"$f":"+'c15'!AA262","v":0},{"$f":"+'c15'!Y263","v":0},{"$f":"+'c15'!AA263","v":0},{"$f":"+'c15'!Y265","v":0},{"$f":"+'c15'!AA265","v":0}]
[3,"Spitale (inclusiv institute cu paturi de spital)",{"$f":"+'c15'!P109","v":0},{"$f":"+'c15'!R109","v":0},{"$f":"+'c15'!P166","v":0},{"$f":"+'c15'!R166","v":0},{"$f":"+'c15'!P170","v":0},{"$f":"+'c15'!R170","v":0},{"$f":"+'c15'!P174","v":0},{"$f":"+'c15'!R174","v":0},{"$f":"+'c15'!P175","v":0},{"$f":"+'c15'!R175","v":0},{"$f":"+'c15'!P176","v":0},{"$f":"+'c15'!R176","v":0},{"$f":"+'c15'!P177","v":0},{"$f":"+'c15'!R177","v":0},{"$f":"+'c15'!P178","v":0},{"$f":"+'c15'!R178","v":0},{"$f":"+'c15'!P180","v":0},{"$f":"+'c15'!R180","v":0}]
[4," - din care: cu normă întreagă",{"$f":"+'c15'!$AB193","v":0},{"$f":"+'c15'!$AD193","v":0},{"$f":"+'c15'!$AB251","v":0},{"$f":"+'c15'!$AD251","v":0},{"$f":"+'c15'!$AB255","v":0},{"$f":"+'c15'!$AD255","v":0},{"$f":"+'c15'!$AB259","v":0},{"$f":"+'c15'!$AD259","v":0},{"$f":"+'c15'!$AB260","v":0},{"$f":"+'c15'!$AD260","v":0},{"$f":"+'c15'!$AB261","v":0},{"$f":"+'c15'!$AD261","v":0},{"$f":"+'c15'!$AB262","v":0},{"$f":"+'c15'!$AD262","v":0},{"$f":"+'c15'!$AB263","v":0},{"$f":"+'c15'!$AD263","v":0},{"$f":"+'c15'!$AB265","v":0},{"$f":"+'c15'!$AD265","v":0}]
[5,"Unități sanitare (inclusiv unități asimilate spitalelor) numai cu internare de zi*",0,0,0,0,0,0,0,0,0,0,0,0,0,0,0,0,0,0]
[6," - din care: cu normă întreagă",0,0,0,0,0,0,0,0,0,0,0,0,0,0,0,0,0,0]
[7,"Centre de sanatate cu paturi de spital",{"$f":"+'c15'!S109","v":0},{"$f":"+'c15'!U109","v":0},{"$f":"+'c15'!S166","v":0},{"$f":"+'c15'!U166","v":0},{"$f":"+'c15'!S170","v":0},{"$f":"+'c15'!U170","v":0},{"$f":"+'c15'!S174","v":0},{"$f":"+'c15'!U174","v":0},{"$f":"+'c15'!S175","v":0},{"$f":"+'c15'!U175","v":0},{"$f":"+'c15'!S176","v":0},{"$f":"+'c15'!U176","v":0},{"$f":"+'c15'!S177","v":0},{"$f":"+'c15'!U177","v":0},{"$f":"+'c15'!S178","v":0},{"$f":"+'c15'!U178","v":0},{"$f":"+'c15'!S180","v":0},{"$f":"+'c15'!U180","v":0}]
[8," - din care: cu normă întreagă",0,0,0,0,0,0,0,0,0,0,0,0,0,0,0,0,0,0]
[9,"Centre de sănătate",{"$f":"+'c15'!BX109","v":0},{"$f":"+'c15'!BZ109","v":0},{"$f":"+'c15'!BX166","v":0},{"$f":"+'c15'!BZ166","v":0},{"$f":"+'c15'!BX170","v":0},{"$f":"+'c15'!BZ170","v":0},{"$f":"+'c15'!BX174","v":0},{"$f":"+'c15'!BZ174","v":0},{"$f":"+'c15'!BX175","v":0},{"$f":"+'c15'!BZ175","v":0},{"$f":"+'c15'!BX176","v":0},{"$f":"+'c15'!BZ176","v":0},{"$f":"+'c15'!BX177","v":0},{"$f":"+'c15'!BZ177","v":0},{"$f":"+'c15'!BX178","v":0},{"$f":"+'c15'!BZ178","v":0},{"$f":"+'c15'!BX180","v":0},{"$f":"+'c15'!BZ180","v":0}]
[10,"Centre de sănătate multifuncționale",0,0,0,0,0,0,0,0,0,0,0,0,0,0,0,0,0,0]
[11," - din care: cu normă întreagă",0,0,0,0,0,0,0,0,0,0,0,0,0,0,0,0,0,0]
[12,"Centre de sănătate mintală",{"$f":"+'c15'!CA109","v":0},{"$f":"+'c15'!CC109","v":0},{"$f":"+'c15'!CA166","v":0},{"$f":"+'c15'!CC166","v":0},{"$f":"+'c15'!CA170","v":0},{"$f":"+'c15'!CC170","v":0},{"$f":"+'c15'!CA174","v":0},{"$f":"+'c15'!CC174","v":0},{"$f":"+'c15'!CA175","v":0},{"$f":"+'c15'!CC175","v":0},{"$f":"+'c15'!CA176","v":0},{"$f":"+'c15'!CC176","v":0},{"$f":"+'c15'!CA177","v":0},{"$f":"+'c15'!CC177","v":0},{"$f":"+'c15'!CA178","v":0},{"$f":"+'c15'!CC178","v":0},{"$f":"+'c15'!CA180","v":0},{"$f":"+'c15'!CC180","v":0}]
[13,"Unităţi medico-sociale",0,0,0,0,0,0,0,0,0,0,0,0,0,0,0,0,0,0]
[14," - din care: cu normă întreagă",0,0,0,0,0,0,0,0,0,0,0,0,0,0,0,0,0,0]
[15,"Sanatorii TBC",{"$f":"+'c15'!V109","v":0},{"$f":"+'c15'!X109","v":0},{"$f":"+'c15'!V166","v":0},{"$f":"+'c15'!X166","v":0},{"$f":"+'c15'!V170","v":0},{"$f":"+'c15'!X170","v":0},{"$f":"+'c15'!V174","v":0},{"$f":"+'c15'!X174","v":0},{"$f":"+'c15'!V175","v":0},{"$f":"+'c15'!X175","v":0},{"$f":"+'c15'!V176","v":0},{"$f":"+'c15'!X176","v":0},{"$f":"+'c15'!V177","v":0},{"$f":"+'c15'!X177","v":0},{"$f":"+'c15'!V178","v":0},{"$f":"+'c15'!X178","v":0},{"$f":"+'c15'!V180","v":0},{"$f":"+'c15'!X180","v":0}]
[16," - din care: cu normă întreagă",0,0,0,0,0,0,0,0,0,0,0,0,0,0,0,0,0,0]
[17,"Preventorii",{"$f":"+'c15'!Y109","v":0},{"$f":"+'c15'!AA109","v":0},{"$f":"+'c15'!Y166","v":0},{"$f":"+'c15'!AA166","v":0},{"$f":"+'c15'!Y170","v":0},{"$f":"+'c15'!AA170","v":0},{"$f":"+'c15'!Y174","v":0},{"$f":"+'c15'!AA174","v":0},{"$f":"+'c15'!Y175","v":0},{"$f":"+'c15'!AA175","v":0},{"$f":"+'c15'!Y176","v":0},{"$f":"+'c15'!AA176","v":0},{"$f":"+'c15'!Y177","v":0},{"$f":"+'c15'!AA177","v":0},{"$f":"+'c15'!Y178","v":0},{"$f":"+'c15'!AA178","v":0},{"$f":"+'c15'!Y180","v":0},{"$f":"+'c15'!AA180","v":0}]
[18," - din care: cu normă întreagă",0,0,0,0,0,0,0,0,0,0,0,0,0,0,0,0,0,0]
[19,"Sanatorii de nevroze sau de neuropsihiatrie",{"$f":"+'c15'!CS109","v":0},{"$f":"+'c15'!CU109","v":0},{"$f":"+'c15'!CS166","v":0},{"$f":"+'c15'!CU166","v":0},{"$f":"+'c15'!CS170","v":0},{"$f":"+'c15'!CU170","v":0},{"$f":"+'c15'!CS174","v":0},{"$f":"+'c15'!CU174","v":0},{"$f":"+'c15'!CS175","v":0},{"$f":"+'c15'!CU175","v":0},{"$f":"+'c15'!CS176","v":0},{"$f":"+'c15'!CU176","v":0},{"$f":"+'c15'!CS177","v":0},{"$f":"+'c15'!CU177","v":0},{"$f":"+'c15'!CS178","v":0},{"$f":"+'c15'!CU178","v":0},{"$f":"+'c15'!CS180","v":0},{"$f":"+'c15'!CU180","v":0}]
[20," - din care: cu normă întreagă",0,0,0,0,0,0,0,0,0,0,0,0,0,0,0,0,0,0]
[21,"Sanatorii balneare ",{"$f":"+'c15'!AB109","v":0},{"$f":"+'c15'!AD109","v":0},{"$f":"+'c15'!AB166","v":0},{"$f":"+'c15'!AD166","v":0},{"$f":"+'c15'!AB170","v":0},{"$f":"+'c15'!AD170","v":0},{"$f":"+'c15'!AB174","v":0},{"$f":"+'c15'!AD174","v":0},{"$f":"+'c15'!AB175","v":0},{"$f":"+'c15'!AD175","v":0},{"$f":"+'c15'!AB176","v":0},{"$f":"+'c15'!AD176","v":0},{"$f":"+'c15'!AB177","v":0},{"$f":"+'c15'!AD177","v":0},{"$f":"+'c15'!AB178","v":0},{"$f":"+'c15'!AD178","v":0},{"$f":"+'c15'!AB180","v":0},{"$f":"+'c15'!AD180","v":0}]
[22," - din care: cu normă întreagă",0,0,0,0,0,0,0,0,0,0,0,0,0,0,0,0,0,0]
[23,"Dispensare medicale ",{"$f":"+'c15'!AE109","v":0},{"$f":"+'c15'!AG109","v":0},{"$f":"+'c15'!AE166","v":0},{"$f":"+'c15'!AG166","v":0},{"$f":"+'c15'!AE170","v":0},{"$f":"+'c15'!AG170","v":0},{"$f":"+'c15'!AE174","v":0},{"$f":"+'c15'!AG174","v":0},{"$f":"+'c15'!AE175","v":0},{"$f":"+'c15'!AG175","v":0},{"$f":"+'c15'!AE176","v":0},{"$f":"+'c15'!AG176","v":0},{"$f":"+'c15'!AE177","v":0},{"$f":"+'c15'!AG177","v":0},{"$f":"+'c15'!AE178","v":0},{"$f":"+'c15'!AG178","v":0},{"$f":"+'c15'!AE180","v":0},{"$f":"+'c15'!AG180","v":0}]
[24,"Cabinete medicale şcolare ",{"$f":"+'c15'!AH109","v":0},{"$f":"+'c15'!AJ109","v":0},{"$f":"+'c15'!AH166","v":0},{"$f":"+'c15'!AJ166","v":0},{"$f":"+'c15'!AH170","v":0},{"$f":"+'c15'!AJ170","v":0},{"$f":"+'c15'!AH174","v":0},{"$f":"+'c15'!AJ174","v":0},{"$f":"+'c15'!AH175","v":0},{"$f":"+'c15'!AJ175","v":0},{"$f":"+'c15'!AH176","v":0},{"$f":"+'c15'!AJ176","v":0},{"$f":"+'c15'!AH177","v":0},{"$f":"+'c15'!AJ177","v":0},{"$f":"+'c15'!AH178","v":0},{"$f":"+'c15'!AJ178","v":0},{"$f":"+'c15'!AH180","v":0},{"$f":"+'c15'!AJ180","v":0}]
[25,"Cabinete medicale studenţeşti",{"$f":"+'c15'!AK109","v":0},{"$f":"+'c15'!AM109","v":0},{"$f":"+'c15'!AK166","v":0},{"$f":"+'c15'!AM166","v":0},{"$f":"+'c15'!AK170","v":0},{"$f":"+'c15'!AM170","v":0},{"$f":"+'c15'!AK174","v":0},{"$f":"+'c15'!AM174","v":0},{"$f":"+'c15'!AK175","v":0},{"$f":"+'c15'!AM175","v":0},{"$f":"+'c15'!AK176","v":0},{"$f":"+'c15'!AM176","v":0},{"$f":"+'c15'!AK177","v":0},{"$f":"+'c15'!AM177","v":0},{"$f":"+'c15'!AK178","v":0},{"$f":"+'c15'!AM178","v":0},{"$f":"+'c15'!AK180","v":0},{"$f":"+'c15'!AM180","v":0}]
[26,"Cabinete independente de medicină generală",{"$f":"'c15'!AN109","v":0},{"$f":"'c15'!AP109","v":0},{"$f":"'c15'!AN166","v":0},{"$f":"'c15'!AP166","v":0},{"$f":"'c15'!AN170","v":0},{"$f":"'c15'!AP170","v":0},{"$f":"'c15'!AN174","v":0},{"$f":"'c15'!AP174","v":0},{"$f":"'c15'!AN175","v":0},{"$f":"'c15'!AP175","v":0},{"$f":"'c15'!AN176","v":0},{"$f":"'c15'!AP176","v":0},{"$f":"'c15'!AN177","v":0},{"$f":"'c15'!AP177","v":0},{"$f":"'c15'!AN178","v":0},{"$f":"'c15'!AP178","v":0},{"$f":"'c15'!AN180","v":0},{"$f":"'c15'!AP180","v":0}]
[27,"Cabinete independente de medicină de familie ",{"$f":"+'c15'!AQ109","v":0},{"$f":"+'c15'!AS109","v":0},{"$f":"+'c15'!AQ166","v":0},{"$f":"+'c15'!AS166","v":0},{"$f":"+'c15'!AQ170","v":0},{"$f":"+'c15'!AS170","v":0},{"$f":"+'c15'!AQ174","v":0},{"$f":"+'c15'!AS174","v":0},{"$f":"+'c15'!AQ175","v":0},{"$f":"+'c15'!AS175","v":0},{"$f":"+'c15'!AQ176","v":0},{"$f":"+'c15'!AS176","v":0},{"$f":"+'c15'!AQ177","v":0},{"$f":"+'c15'!AS177","v":0},{"$f":"+'c15'!AQ178","v":0},{"$f":"+'c15'!AS178","v":0},{"$f":"+'c15'!AQ180","v":0},{"$f":"+'c15'!AS180","v":0},{"$f":"IF(E241>=C293,\"OK\",\"Err\")","v":"OK"},{"$f":"IF(F241>=D293,\"OK\",\"Err\")","v":"OK"}]
[28,"Societăţi medicale civile ",{"$f":"+'c15'!DB109","v":0},{"$f":"+'c15'!DD109","v":0},{"$f":"+'c15'!DB166","v":0},{"$f":"+'c15'!DD166","v":0},{"$f":"+'c15'!DB170","v":0},{"$f":"+'c15'!DD170","v":0},{"$f":"+'c15'!DB174","v":0},{"$f":"+'c15'!DD174","v":0},{"$f":"+'c15'!DB175","v":0},{"$f":"+'c15'!DD175","v":0},{"$f":"+'c15'!DB176","v":0},{"$f":"+'c15'!DD176","v":0},{"$f":"+'c15'!DB177","v":0},{"$f":"+'c15'!DD177","v":0},{"$f":"+'c15'!DB178","v":0},{"$f":"+'c15'!DD178","v":0},{"$f":"+'c15'!DB180","v":0},{"$f":"+'c15'!DD180","v":0}]
[29,"Farmacii",{"$f":"+'c15'!AT109","v":0},{"$f":"+'c15'!AV109","v":0},{"$f":"+'c15'!AT166","v":0},{"$f":"+'c15'!AV166","v":0},{"$f":"+'c15'!AT170","v":0},{"$f":"+'c15'!AV170","v":0},{"$f":"+'c15'!AT174","v":0},{"$f":"+'c15'!AV174","v":0},{"$f":"+'c15'!AT175","v":0},{"$f":"+'c15'!AV175","v":0},{"$f":"+'c15'!AT176","v":0},{"$f":"+'c15'!AV176","v":0},{"$f":"+'c15'!AT177","v":0},{"$f":"+'c15'!AV177","v":0},{"$f":"+'c15'!AT178","v":0},{"$f":"+'c15'!AV178","v":0},{"$f":"+'c15'!AT180","v":0},{"$f":"+'c15'!AV180","v":0}]
[30,"Puncte de lucru ale farmaciilor",{"$f":"+'c15'!AW109","v":0},{"$f":"+'c15'!AY109","v":0},{"$f":"+'c15'!AW166","v":0},{"$f":"+'c15'!AY166","v":0},{"$f":"+'c15'!AW170","v":0},{"$f":"+'c15'!AY170","v":0},{"$f":"+'c15'!AW174","v":0},{"$f":"+'c15'!AY174","v":0},{"$f":"+'c15'!AW175","v":0},{"$f":"+'c15'!AY175","v":0},{"$f":"+'c15'!AW176","v":0},{"$f":"+'c15'!AY176","v":0},{"$f":"+'c15'!AW177","v":0},{"$f":"+'c15'!AY177","v":0},{"$f":"+'c15'!AW178","v":0},{"$f":"+'c15'!AY178","v":0},{"$f":"+'c15'!AW180","v":0},{"$f":"+'c15'!AY180","v":0}]
[31,"Drogherii",0,0,0,0,0,0,0,0,0,0,0,0,0,0,0,0,0,0]
[32,"Depozite farmaceutice",{"$f":"+'c15'!AZ109","v":0},{"$f":"+'c15'!BB109","v":0},{"$f":"+'c15'!AZ166","v":0},{"$f":"+'c15'!BB166","v":0},{"$f":"+'c15'!AZ170","v":0},{"$f":"+'c15'!BB170","v":0},{"$f":"+'c15'!AZ174","v":0},{"$f":"+'c15'!BB174","v":0},{"$f":"+'c15'!AZ175","v":0},{"$f":"+'c15'!BB175","v":0},{"$f":"+'c15'!AZ176","v":0},{"$f":"+'c15'!BB176","v":0},{"$f":"+'c15'!AZ177","v":0},{"$f":"+'c15'!BB177","v":0},{"$f":"+'c15'!AZ178","v":0},{"$f":"+'c15'!BB178","v":0},{"$f":"+'c15'!AZ180","v":0},{"$f":"+'c15'!BB180","v":0}]
[33,"Policlinici",{"$f":"+'c15'!BC109","v":0},{"$f":"+'c15'!BE109","v":0},{"$f":"+'c15'!BC166","v":0},{"$f":"+'c15'!BE166","v":0},{"$f":"+'c15'!BC170","v":0},{"$f":"+'c15'!BE170","v":0},{"$f":"+'c15'!BC174","v":0},{"$f":"+'c15'!BE174","v":0},{"$f":"+'c15'!BC175","v":0},{"$f":"+'c15'!BE175","v":0},{"$f":"+'c15'!BC176","v":0},{"$f":"+'c15'!BE176","v":0},{"$f":"+'c15'!BC177","v":0},{"$f":"+'c15'!BE177","v":0},{"$f":"+'c15'!BC178","v":0},{"$f":"+'c15'!BE178","v":0},{"$f":"+'c15'!BC180","v":0},{"$f":"+'c15'!BE180","v":0}]
[34,"Centre de dializă și puncte ale centrelor de dializă",0,0,0,0,0,0,0,0,0,0,0,0,0,0,0,0,0,0]
[35," - din care: cu normă întreagă",0,0,0,0,0,0,0,0,0,0,0,0,0,0,0,0,0,0]
[36,"Centre de diagnostic şi tratament ",{"$f":"+'c15'!BF109","v":0},{"$f":"+'c15'!BH109","v":0},{"$f":"+'c15'!BF166","v":0},{"$f":"+'c15'!BH166","v":0},{"$f":"+'c15'!BF170","v":0},{"$f":"+'c15'!BH170","v":0},{"$f":"+'c15'!BF174","v":0},{"$f":"+'c15'!BH174","v":0},{"$f":"+'c15'!BF175","v":0},{"$f":"+'c15'!BH175","v":0},{"$f":"+'c15'!BF176","v":0},{"$f":"+'c15'!BH176","v":0},{"$f":"+'c15'!BF177","v":0},{"$f":"+'c15'!BH177","v":0},{"$f":"+'c15'!BF178","v":0},{"$f":"+'c15'!BH178","v":0},{"$f":"+'c15'!BF180","v":0},{"$f":"+'c15'!BH180","v":0}]
[37,"Centre medicale de specialitate",{"$f":"+'c15'!BI109","v":0},{"$f":"+'c15'!BK109","v":0},{"$f":"+'c15'!BI166","v":0},{"$f":"+'c15'!BK166","v":0},{"$f":"+'c15'!BI170","v":0},{"$f":"+'c15'!BK170","v":0},{"$f":"+'c15'!BI174","v":0},{"$f":"+'c15'!BK174","v":0},{"$f":"+'c15'!BI175","v":0},{"$f":"+'c15'!BK175","v":0},{"$f":"+'c15'!BI176","v":0},{"$f":"+'c15'!BK176","v":0},{"$f":"+'c15'!BI177","v":0},{"$f":"+'c15'!BK177","v":0},{"$f":"+'c15'!BI178","v":0},{"$f":"+'c15'!BK178","v":0},{"$f":"+'c15'!BI180","v":0},{"$f":"+'c15'!BK180","v":0}]
[38,"Ambulatorii de specialitate ",{"$f":"+'c15'!BL109","v":0},{"$f":"+'c15'!BN109","v":0},{"$f":"+'c15'!BL166","v":0},{"$f":"+'c15'!BN166","v":0},{"$f":"+'c15'!BL170","v":0},{"$f":"+'c15'!BN170","v":0},{"$f":"+'c15'!BL174","v":0},{"$f":"+'c15'!BN174","v":0},{"$f":"+'c15'!BL175","v":0},{"$f":"+'c15'!BN175","v":0},{"$f":"+'c15'!BL176","v":0},{"$f":"+'c15'!BN176","v":0},{"$f":"+'c15'!BL177","v":0},{"$f":"+'c15'!BN177","v":0},{"$f":"+'c15'!BL178","v":0},{"$f":"+'c15'!BN178","v":0},{"$f":"+'c15'!BL180","v":0},{"$f":"+'c15'!BN180","v":0}]
[39,"Ambulatorii integrate spitalului ",{"$f":"+'c15'!BO109","v":0},{"$f":"+'c15'!BQ109","v":0},{"$f":"+'c15'!BO166","v":0},{"$f":"+'c15'!BQ166","v":0},{"$f":"+'c15'!BO170","v":0},{"$f":"+'c15'!BQ170","v":0},{"$f":"+'c15'!BO174","v":0},{"$f":"+'c15'!BQ174","v":0},{"$f":"+'c15'!BO175","v":0},{"$f":"+'c15'!BQ175","v":0},{"$f":"+'c15'!BO176","v":0},{"$f":"+'c15'!BQ176","v":0},{"$f":"+'c15'!BO177","v":0},{"$f":"+'c15'!BQ177","v":0},{"$f":"+'c15'!BO178","v":0},{"$f":"+'c15'!BQ178","v":0},{"$f":"+'c15'!BO180","v":0},{"$f":"+'c15'!BQ180","v":0}]
[40,"Cabinete stomatologice şcolare ",0,0,0,0,0,0,0,0,0,0,0,0,0,0,0,0,0,0]
[41,"Cabinete stomatologice studenţeşti",0,0,0,0,0,0,0,0,0,0,0,0,0,0,0,0,0,0]
[42,"Cabinete stomatologice independente",{"$f":"+'c15'!BR109","v":0},{"$f":"+'c15'!BT109","v":0},{"$f":"+'c15'!BR166","v":0},{"$f":"+'c15'!BT166","v":0},{"$f":"+'c15'!BR170","v":0},{"$f":"+'c15'!BT170","v":0},{"$f":"+'c15'!BR174","v":0},{"$f":"+'c15'!BT174","v":0},{"$f":"+'c15'!BR175","v":0},{"$f":"+'c15'!BT175","v":0},{"$f":"+'c15'!BR176","v":0},{"$f":"+'c15'!BT176","v":0},{"$f":"+'c15'!BR177","v":0},{"$f":"+'c15'!BT177","v":0},{"$f":"+'c15'!BR178","v":0},{"$f":"+'c15'!BT178","v":0},{"$f":"+'c15'!BR180","v":0},{"$f":"+'c15'!BT180","v":0}]
[43,"Societăţi stomatologice civile medicale ",{"$f":"+'c15'!DE109","v":0},{"$f":"+'c15'!DG109","v":0},{"$f":"+'c15'!DE166","v":0},{"$f":"+'c15'!DG166","v":0},{"$f":"+'c15'!DE170","v":0},{"$f":"+'c15'!DG170","v":0},{"$f":"+'c15'!DE174","v":0},{"$f":"+'c15'!DG174","v":0},{"$f":"+'c15'!DE175","v":0},{"$f":"+'c15'!DG175","v":0},{"$f":"+'c15'!DE176","v":0},{"$f":"+'c15'!DG176","v":0},{"$f":"+'c15'!DE177","v":0},{"$f":"+'c15'!DG177","v":0},{"$f":"+'c15'!DE178","v":0},{"$f":"+'c15'!DG178","v":0},{"$f":"+'c15'!DE180","v":0},{"$f":"+'c15'!DG180","v":0}]
[44,"Cabinete medicale independente de specialitate ",{"$f":"+'c15'!BU109","v":0},{"$f":"+'c15'!BW109","v":0},{"$f":"+'c15'!BU166","v":0},{"$f":"+'c15'!BW166","v":0},{"$f":"+'c15'!BU170","v":0},{"$f":"+'c15'!BW170","v":0},{"$f":"+'c15'!BU174","v":0},{"$f":"+'c15'!BW174","v":0},{"$f":"+'c15'!BU175","v":0},{"$f":"+'c15'!BW175","v":0},{"$f":"+'c15'!BU176","v":0},{"$f":"+'c15'!BW176","v":0},{"$f":"+'c15'!BU177","v":0},{"$f":"+'c15'!BW177","v":0},{"$f":"+'c15'!BU178","v":0},{"$f":"+'c15'!BW178","v":0},{"$f":"+'c15'!BU180","v":0},{"$f":"+'c15'!BW180","v":0}]
[45,"Societăţi civile medicale de specialitate ",{"$f":"+'c15'!DH109","v":0},{"$f":"+'c15'!DJ109","v":0},{"$f":"+'c15'!DH166","v":0},{"$f":"+'c15'!DJ166","v":0},{"$f":"+'c15'!DH170","v":0},{"$f":"+'c15'!DJ170","v":0},{"$f":"+'c15'!DH174","v":0},{"$f":"+'c15'!DJ174","v":0},{"$f":"+'c15'!DH175","v":0},{"$f":"+'c15'!DJ175","v":0},{"$f":"+'c15'!DH176","v":0},{"$f":"+'c15'!DJ176","v":0},{"$f":"+'c15'!DH177","v":0},{"$f":"+'c15'!DJ177","v":0},{"$f":"+'c15'!DH178","v":0},{"$f":"+'c15'!DJ178","v":0},{"$f":"+'c15'!DH180","v":0},{"$f":"+'c15'!DJ180","v":0}]
[46,"Centre de transfuzie sanguină",{"$f":"+'c15'!CD109","v":0},{"$f":"+'c15'!CF109","v":0},{"$f":"+'c15'!CD166","v":0},{"$f":"+'c15'!CF166","v":0},{"$f":"+'c15'!CD170","v":0},{"$f":"+'c15'!CF170","v":0},{"$f":"+'c15'!CD174","v":0},{"$f":"+'c15'!CF174","v":0},{"$f":"+'c15'!CD175","v":0},{"$f":"+'c15'!CF175","v":0},{"$f":"+'c15'!CD176","v":0},{"$f":"+'c15'!CF176","v":0},{"$f":"+'c15'!CD177","v":0},{"$f":"+'c15'!CF177","v":0},{"$f":"+'c15'!CD178","v":0},{"$f":"+'c15'!CF178","v":0},{"$f":"+'c15'!CD180","v":0},{"$f":"+'c15'!CF180","v":0}]
[47,"Laboratoare medicale",{"$f":"+'c15'!CG109","v":0},{"$f":"+'c15'!CI109","v":0},{"$f":"+'c15'!CG166","v":0},{"$f":"+'c15'!CI166","v":0},{"$f":"+'c15'!CG170","v":0},{"$f":"+'c15'!CI170","v":0},{"$f":"+'c15'!CG174","v":0},{"$f":"+'c15'!CI174","v":0},{"$f":"+'c15'!CG175","v":0},{"$f":"+'c15'!CI175","v":0},{"$f":"+'c15'!CG176","v":0},{"$f":"+'c15'!CI176","v":0},{"$f":"+'c15'!CG177","v":0},{"$f":"+'c15'!CI177","v":0},{"$f":"+'c15'!CG178","v":0},{"$f":"+'c15'!CI178","v":0},{"$f":"+'c15'!CG180","v":0},{"$f":"+'c15'!CI180","v":0}]
[48,"Laboratoare de tehnică dentară",{"$f":"+'c15'!CJ109","v":0},{"$f":"+'c15'!CL109","v":0},{"$f":"+'c15'!CJ166","v":0},{"$f":"+'c15'!CL166","v":0},{"$f":"+'c15'!CJ170","v":0},{"$f":"+'c15'!CL170","v":0},{"$f":"+'c15'!CJ174","v":0},{"$f":"+'c15'!CL174","v":0},{"$f":"+'c15'!CJ175","v":0},{"$f":"+'c15'!CL175","v":0},{"$f":"+'c15'!CJ176","v":0},{"$f":"+'c15'!CL176","v":0},{"$f":"+'c15'!CJ177","v":0},{"$f":"+'c15'!CL177","v":0},{"$f":"+'c15'!CJ178","v":0},{"$f":"+'c15'!CL178","v":0},{"$f":"+'c15'!CJ180","v":0},{"$f":"+'c15'!CL180","v":0}]
[49,"Unități de ambulanță, transportul pacienților și SMURD",{"$f":"+'c15'!CV109","v":0},{"$f":"+'c15'!CX109","v":0},{"$f":"+'c15'!CV166","v":0},{"$f":"+'c15'!CX166","v":0},{"$f":"+'c15'!CV170","v":0},{"$f":"+'c15'!CX170","v":0},{"$f":"+'c15'!CV174","v":0},{"$f":"+'c15'!CX174","v":0},{"$f":"+'c15'!CV175","v":0},{"$f":"+'c15'!CX175","v":0},{"$f":"+'c15'!CV176","v":0},{"$f":"+'c15'!CX176","v":0},{"$f":"+'c15'!CV177","v":0},{"$f":"+'c15'!CX177","v":0},{"$f":"+'c15'!CV178","v":0},{"$f":"+'c15'!CX178","v":0},{"$f":"+'c15'!CV180","v":0},{"$f":"+'c15'!CX180","v":0}]
[50,"Alte tipuri de cabinete medicale",0,0,0,0,0,0,0,0,0,0,0,0,0,0,0,0,0,0]
[51,"Unități rezidențiale pentru persoanele cu dizabilități",0,0,0,0,0,0,0,0,0,0,0,0,0,0,0,0,0,0]
[52,"Centre de zi pentru persoanele cu dizabilități",0,0,0,0,0,0,0,0,0,0,0,0,0,0,0,0,0,0]
[53,"Unități rezidențiale pentru persoanele vârstnice care oferă îngriji medicale în cadrul unității",0,0,0,0,0,0,0,0,0,0,0,0,0,0,0,0,0,0]
[54,"Alte unități de asistență socială care furnizează îngrijiri medicale",0,0,0,0,0,0,0,0,0,0,0,0,0,0,0,0,0,0]
[55,"Institute şi instituţii fără paturi *",{"$f":"+'c15'!CM109+'c15'!CP109+'c15'!CY109","v":0},{"$f":"+'c15'!CO109+'c15'!CR109+'c15'!DA109","v":0},{"$f":"+'c15'!CM166+'c15'!CP166+'c15'!CY166","v":0},{"$f":"+'c15'!CO166+'c15'!CR166+'c15'!DA166","v":0},{"$f":"+'c15'!CM170+'c15'!CP170+'c15'!CY170","v":0},{"$f":"+'c15'!CO170+'c15'!CR170+'c15'!DA170","v":0},{"$f":"+'c15'!CM174+'c15'!CP174+'c15'!CY174","v":0},{"$f":"+'c15'!CO174+'c15'!CR174+'c15'!DA174","v":0},{"$f":"+'c15'!CM175+'c15'!CP175+'c15'!CY175","v":0},{"$f":"+'c15'!CO175+'c15'!CR175+'c15'!DA175","v":0},{"$f":"+'c15'!CM176+'c15'!CP176+'c15'!CY176","v":0},{"$f":"+'c15'!CO176+'c15'!CR176+'c15'!DA176","v":0},{"$f":"+'c15'!CM177+'c15'!CP177+'c15'!CY177","v":0},{"$f":"+'c15'!CO177+'c15'!CR177+'c15'!DA177","v":0},{"$f":"+'c15'!CM178+'c15'!CP178+'c15'!CY178","v":0},{"$f":"+'c15'!CO178+'c15'!CR178+'c15'!DA178","v":0},{"$f":"+'c15'!CM180+'c15'!CP180+'c15'!CY180","v":0},{"$f":"+'c15'!CO180+'c15'!CR180+'c15'!DA180","v":0}]
[56,"Alte unități *",0,0,0,0,0,0,0,0,0,0,0,0,0,0,0,0,0,0]
["Cap.8  Numărul personalului cu studii medii, existent la sfârşitul anului, pe tipuri de unităţi sanitare și pe unități din sfera asistenței sociale în care se furnizează și îngrijiri medicale",null,null,null,null,null,{"$f":"IF(C330=E255,\"OK\",\"Err\")","v":"OK"},{"$f":"IF(D330=F255,\"OK\",\"Err\")","v":"OK"},{"$f":"IF(E330=E256,\"OK\",\"Err\")","v":"OK"},{"$f":"IF(F330=F256,\"OK\",\"Err\")","v":"OK"},{"$f":"IF(G330=E257,\"OK\",\"Err\")","v":"OK"},{"$f":"IF(H330=F257,\"OK\",\"Err\")","v":"OK"},{"$f":"IF(I330=E258,\"OK\",\"Err\")","v":"OK"},{"$f":"IF(J330=F258,\"OK\",\"Err\")","v":"OK"}]
["Nr. Crt.","Tipuri de unităţi sanitare","PERSONAL SANITAR MEDIU ",null,null,null,null,null,null,null,null,null,{"$f":"IF(K330=E259,\"OK\",\"Err\")","v":"OK"},{"$f":"IF(L330=F259,\"OK\",\"Err\")","v":"OK"}]
[null,null,"TOTAL","din care: femei","ASISTENTI MEDICALI",null,null,null,null,null,null,null,{"$f":"IF(M330=E260,\"OK\",\"Err\")","v":"OK"},{"$f":"IF(N330=F260,\"OK\",\"Err\")","v":"OK"},{"$f":"IF(O330=E261,\"OK\",\"Err\")","v":"OK"},{"$f":"IF(P330=F261,\"OK\",\"Err\")","v":"OK"}]
[null,null,null,null,"TOTAL ASIS-TENŢI","din care: femei","Asistenți obstetrică-ginecologie (moaşe)",null,"Asistenţi fiziokinetoterapeuţi",null,null,null,"Personal sanitar auxiliar",null,"Alt personal mediu angajat"]
[null,null,null,null,null,null,null,null,"Total","din care: femei","asistenţi fizioterapeuţi"]
[null,null,null,null,null,null,"Total","d.c: femei",null,null,"Total","d.c: femei","Total","d.c: femei","Total","d.c: femei"]
["A","B","1","2","3","4","5","6","7","8","9","10","11","12","13","14"]
[1,"Total personal cu studii medii",{"$f":"SUM(C332:C385)-C333-C335-C337-C340-C343-C345-C347-C349-C351-C364","v":0},{"$f":"SUM(D332:D385)-D333-D335-D337-D340-D343-D345-D347-D349-D351-D364","v":0},0,0,0,0,0,0,0,0,0,0,0,0]
[2," - din care: cu normă întreagă",{"$f":"+'c15'!Y62","v":0},{"$f":"+'c15'!AA62","v":0},{"$f":"+'c15'!$Y63","v":0},{"$f":"+'c15'!$AA63","v":0},{"$f":"+'c15'!$Y66","v":0},{"$f":"+'c15'!$AA66","v":0},{"$f":"+'c15'!$Y74","v":0},{"$f":"+'c15'!$AA74","v":0},{"$f":"+'c15'!$Y75","v":0},{"$f":"+'c15'!$AA75","v":0},{"$f":"+'c15'!$Y94","v":0},{"$f":"+'c15'!$AA94","v":0},{"$f":"+'c15'!Y95+'c15'!Y96+'c15'!Y97","v":0},{"$f":"+'c15'!AA95+'c15'!AA96+'c15'!AA97","v":0}]
[3,"Spitale (inclusiv institute cu paturi de spital)",{"$f":"+'c15'!G15","v":0},{"$f":"+'c15'!I15","v":0},{"$f":"+'c15'!G16","v":0},{"$f":"+'c15'!I16","v":0},{"$f":"+'c15'!G19","v":0},{"$f":"+'c15'!I19","v":0},{"$f":"+'c15'!G27","v":0},{"$f":"+'c15'!I27","v":0},{"$f":"+'c15'!G28","v":0},{"$f":"+'c15'!I28","v":0},{"$f":"+'c15'!G47","v":0},{"$f":"+'c15'!I47","v":0},{"$f":"+'c15'!G48+'c15'!G49+'c15'!G50","v":0},{"$f":"+'c15'!I48+'c15'!I49+'c15'!I50","v":0}]
[4," - din care: cu normă întreagă",{"$f":"+'c15'!$AB$62","v":0},{"$f":"+'c15'!$AD$62","v":0},{"$f":"+'c15'!$AB$63","v":0},{"$f":"+'c15'!$AD$63","v":0},{"$f":"+'c15'!$AB$66","v":0},{"$f":"+'c15'!$AD$66","v":0},{"$f":"+'c15'!$AB$74","v":0},{"$f":"+'c15'!$AD$74","v":0},{"$f":"+'c15'!$AB$75","v":0},{"$f":"+'c15'!$AD$75","v":0},{"$f":"+'c15'!$AB$94","v":0},{"$f":"+'c15'!$AD$94","v":0},{"$f":"+'c15'!$AB$95+'c15'!$AB$96+'c15'!$AB$97","v":0},{"$f":"+'c15'!$AD$95+'c15'!$AD$96+'c15'!$AD$97","v":0}]
[5,"Unități sanitare (inclusiv unități asimilate spitalelor) numai cu internare de zi*",0,0,0,0,0,0,0,0,0,0,0,0,0,0]
[6," - din care: cu normă întreagă",0,0,0,0,0,0,0,0,0,0,0,0,0,0]
[7,"Centre de sanatate cu paturi de spital",{"$f":"+'c15'!J15","v":0},{"$f":"+'c15'!L15","v":0},{"$f":"+'c15'!J16","v":0},{"$f":"+'c15'!L16","v":0},{"$f":"+'c15'!J19","v":0},{"$f":"+'c15'!L19","v":0},{"$f":"+'c15'!J27","v":0},{"$f":"+'c15'!L27","v":0},{"$f":"+'c15'!J28","v":0},{"$f":"+'c15'!L28","v":0},{"$f":"+'c15'!J47","v":0},{"$f":"+'c15'!L47","v":0},{"$f":"+'c15'!J48+'c15'!J49+'c15'!J50","v":0},{"$f":"+'c15'!L48+'c15'!L49+'c15'!L50","v":0}]
[8," - din care: cu normă întreagă",0,0,0,0,0,0,0,0,0,0,0,0,0,0]
[9,"Centre de sănătate",{"$f":"+'c15'!BO15","v":0},{"$f":"+'c15'!BQ15","v":0},{"$f":"+'c15'!BO16","v":0},{"$f":"+'c15'!BQ16","v":0},{"$f":"+'c15'!BO19","v":0},{"$f":"+'c15'!BQ19","v":0},{"$f":"+'c15'!BO27","v":0},{"$f":"+'c15'!BQ27","v":0},{"$f":"+'c15'!BO28","v":0},{"$f":"+'c15'!BQ28","v":0},{"$f":"+'c15'!BO47","v":0},{"$f":"+'c15'!BQ47","v":0},{"$f":"+'c15'!BO48+'c15'!BO49+'c15'!BO50","v":0},{"$f":"+'c15'!BQ48+'c15'!BQ49+'c15'!BQ50","v":0}]
[10,"Centre de sănătate multifuncționale",0,0,0,0,0,0,0,0,0,0,0,0,0,0]
[11," - din care: cu normă întreagă",0,0,0,0,0,0,0,0,0,0,0,0,0,0]
[12,"Centre de sănătate mintală",{"$f":"+'c15'!BR15","v":0},{"$f":"+'c15'!BT15","v":0},{"$f":"+'c15'!BR16","v":0},{"$f":"+'c15'!BT16","v":0},{"$f":"+'c15'!BR19","v":0},{"$f":"+'c15'!BT19","v":0},{"$f":"+'c15'!BR27","v":0},{"$f":"+'c15'!BT27","v":0},{"$f":"+'c15'!BR28","v":0},{"$f":"+'c15'!BT28","v":0},{"$f":"+'c15'!BR47","v":0},{"$f":"+'c15'!BT47","v":0},{"$f":"+'c15'!BR48+'c15'!BR49+'c15'!BR50","v":0},{"$f":"+'c15'!BT48+'c15'!BT49+'c15'!BT50","v":0}]
[13,"Unităţi medico-sociale",0,0,0,0,0,0,0,0,0,0,0,0,0,0]
[14," - din care: cu normă întreagă",0,0,0,0,0,0,0,0,0,0,0,0,0,0]
[15,"Sanatorii TBC",{"$f":"+'c15'!M15","v":0},{"$f":"+'c15'!O15","v":0},{"$f":"+'c15'!M16","v":0},{"$f":"+'c15'!O16","v":0},{"$f":"+'c15'!M19","v":0},{"$f":"+'c15'!O19","v":0},{"$f":"+'c15'!M27","v":0},{"$f":"+'c15'!O27","v":0},{"$f":"+'c15'!M28","v":0},{"$f":"+'c15'!O28","v":0},{"$f":"+'c15'!M47","v":0},{"$f":"+'c15'!O47","v":0},{"$f":"+'c15'!M48+'c15'!M49+'c15'!M50","v":0},{"$f":"+'c15'!O48+'c15'!O49+'c15'!O50","v":0}]
[16," - din care: cu normă întreagă",0,0,0,0,0,0,0,0,0,0,0,0,0,0]
[17,"Preventorii",{"$f":"+'c15'!P15","v":0},{"$f":"+'c15'!R15","v":0},{"$f":"+'c15'!P16","v":0},{"$f":"+'c15'!R16","v":0},{"$f":"+'c15'!P19","v":0},{"$f":"+'c15'!R19","v":0},{"$f":"+'c15'!P27","v":0},{"$f":"+'c15'!R27","v":0},{"$f":"+'c15'!P28","v":0},{"$f":"+'c15'!R28","v":0},{"$f":"+'c15'!P47","v":0},{"$f":"+'c15'!R47","v":0},{"$f":"+'c15'!P48+'c15'!P49+'c15'!P50","v":0},{"$f":"+'c15'!R48+'c15'!R49+'c15'!R50","v":0}]
[18," - din care: cu normă întreagă",0,0,0,0,0,0,0,0,0,0,0,0,0,0]
[19,"Sanatorii de nevroze sau de neuropsihiatrie",{"$f":"+'c15'!CJ15","v":0},{"$f":"+'c15'!CL15","v":0},{"$f":"+'c15'!CJ16","v":0},{"$f":"+'c15'!CL16","v":0},{"$f":"+'c15'!CJ19","v":0},{"$f":"+'c15'!CL19","v":0},{"$f":"+'c15'!CJ27","v":0},{"$f":"+'c15'!CL27","v":0},{"$f":"+'c15'!CJ28","v":0},{"$f":"+'c15'!CL28","v":0},{"$f":"+'c15'!CJ47","v":0},{"$f":"+'c15'!CL47","v":0},{"$f":"+'c15'!CJ48+'c15'!CJ49+'c15'!CJ50","v":0},{"$f":"+'c15'!CL48+'c15'!CL49+'c15'!CL50","v":0}]
[20," - din care: cu normă întreagă",0,0,0,0,0,0,0,0,0,0,0,0,0,0]
[21,"Sanatorii balneare ",{"$f":"+'c15'!S15","v":0},{"$f":"+'c15'!U15","v":0},{"$f":"+'c15'!S16","v":0},{"$f":"+'c15'!U16","v":0},{"$f":"+'c15'!S19","v":0},{"$f":"+'c15'!U19","v":0},{"$f":"+'c15'!S27","v":0},{"$f":"+'c15'!U27","v":0},{"$f":"+'c15'!S28","v":0},{"$f":"+'c15'!U28","v":0},{"$f":"+'c15'!S47","v":0},{"$f":"+'c15'!U47","v":0},{"$f":"+'c15'!S48+'c15'!S49+'c15'!S50","v":0},{"$f":"+'c15'!U48+'c15'!U49+'c15'!U50","v":0}]
[22," - din care: cu normă întreagă",0,0,0,0,0,0,0,0,0,0,0,0,0,0]
[23,"Dispensare medicale ",{"$f":"+'c15'!V15","v":0},{"$f":"+'c15'!X15","v":0},{"$f":"+'c15'!V16","v":0},{"$f":"+'c15'!X16","v":0},{"$f":"+'c15'!V19","v":0},{"$f":"+'c15'!X19","v":0},{"$f":"+'c15'!V27","v":0},{"$f":"+'c15'!X27","v":0},{"$f":"+'c15'!V28","v":0},{"$f":"+'c15'!X28","v":0},{"$f":"+'c15'!V47","v":0},{"$f":"+'c15'!X47","v":0},{"$f":"+'c15'!V48+'c15'!V49+'c15'!V50","v":0},{"$f":"+'c15'!X48+'c15'!X49+'c15'!X50","v":0}]
[24,"Cabinete medicale şcolare ",{"$f":"+'c15'!Y15","v":0},{"$f":"+'c15'!AA15","v":0},{"$f":"+'c15'!Y16","v":0},{"$f":"+'c15'!AA16","v":0},{"$f":"+'c15'!Y19","v":0},{"$f":"+'c15'!AA19","v":0},{"$f":"+'c15'!Y27","v":0},{"$f":"+'c15'!AA27","v":0},{"$f":"+'c15'!Y28","v":0},{"$f":"+'c15'!AA28","v":0},{"$f":"+'c15'!Y47","v":0},{"$f":"+'c15'!AA47","v":0},{"$f":"+'c15'!Y48+'c15'!Y49+'c15'!Y50","v":0},{"$f":"+'c15'!AA48+'c15'!AA49+'c15'!AA50","v":0}]
[25,"Cabinete medicale studenţeşti",{"$f":"+'c15'!AB15","v":0},{"$f":"+'c15'!AD15","v":0},{"$f":"+'c15'!AB16","v":0},{"$f":"+'c15'!AD16","v":0},{"$f":"+'c15'!AB19","v":0},{"$f":"+'c15'!AD19","v":0},{"$f":"+'c15'!AB27","v":0},{"$f":"+'c15'!AD27","v":0},{"$f":"+'c15'!AB28","v":0},{"$f":"+'c15'!AD28","v":0},{"$f":"+'c15'!AB47","v":0},{"$f":"+'c15'!AD47","v":0},{"$f":"+'c15'!AB48+'c15'!AB49+'c15'!AB50","v":0},{"$f":"+'c15'!AD48+'c15'!AD49+'c15'!AD50","v":0}]
[26,"Cabinete independente de medicină generală",{"$f":"'c15'!AE15","v":0},{"$f":"'c15'!AG15","v":0},{"$f":"'c15'!AE16","v":0},{"$f":"'c15'!AG16","v":0},{"$f":"'c15'!AE19","v":0},{"$f":"'c15'!AG19","v":0},{"$f":"'c15'!AE27","v":0},{"$f":"'c15'!AG27","v":0},{"$f":"'c15'!AE28","v":0},{"$f":"'c15'!AG28","v":0},{"$f":"'c15'!AE47","v":0},{"$f":"'c15'!AG47","v":0},{"$f":"+'c15'!AE48+'c15'!AE49+'c15'!AE50","v":0},{"$f":"+'c15'!AG48+'c15'!AG49+'c15'!AG50","v":0}]
[27,"Cabinete independente de medicină de familie ",{"$f":"+'c15'!AH15","v":0},{"$f":"+'c15'!AJ15","v":0},{"$f":"+'c15'!AH16","v":0},{"$f":"+'c15'!AJ16","v":0},{"$f":"+'c15'!AH19","v":0},{"$f":"+'c15'!AJ19","v":0},{"$f":"+'c15'!AH27","v":0},{"$f":"+'c15'!AJ27","v":0},{"$f":"+'c15'!AH28","v":0},{"$f":"+'c15'!AJ28","v":0},{"$f":"+'c15'!AH47","v":0},{"$f":"+'c15'!AJ47","v":0},{"$f":"+'c15'!AH48+'c15'!AH49+'c15'!AH50","v":0},{"$f":"+'c15'!AJ48+'c15'!AJ49+'c15'!AJ50","v":0}]
[28,"Societăţi medicale civile ",{"$f":"+'c15'!CS15","v":0},{"$f":"+'c15'!CU15","v":0},{"$f":"+'c15'!CS16","v":0},{"$f":"+'c15'!CU16","v":0},{"$f":"+'c15'!CS19","v":0},{"$f":"+'c15'!CU19","v":0},{"$f":"+'c15'!CS27","v":0},{"$f":"+'c15'!CU27","v":0},{"$f":"+'c15'!CS28","v":0},{"$f":"+'c15'!CU28","v":0},{"$f":"+'c15'!CS47","v":0},{"$f":"+'c15'!CU47","v":0},{"$f":"+'c15'!CS48+'c15'!CS49+'c15'!CS50","v":0},{"$f":"+'c15'!CU48+'c15'!CU49+'c15'!CU50","v":0}]
[29,"Farmacii",{"$f":"+'c15'!AK15","v":0},{"$f":"+'c15'!AM15","v":0},{"$f":"+'c15'!AK16","v":0},{"$f":"+'c15'!AM16","v":0},{"$f":"+'c15'!AK19","v":0},{"$f":"+'c15'!AM19","v":0},{"$f":"+'c15'!AK27","v":0},{"$f":"+'c15'!AM27","v":0},{"$f":"+'c15'!AK28","v":0},{"$f":"+'c15'!AM28","v":0},{"$f":"+'c15'!AK47","v":0},{"$f":"+'c15'!AM47","v":0},{"$f":"+'c15'!AK48+'c15'!AK49+'c15'!AK50","v":0},{"$f":"+'c15'!AM48+'c15'!AM49+'c15'!AM50","v":0}]
[30,"Puncte de lucru ale farmaciilor",{"$f":"+'c15'!AN15","v":0},{"$f":"+'c15'!AP15","v":0},{"$f":"+'c15'!AN16","v":0},{"$f":"+'c15'!AP16","v":0},{"$f":"+'c15'!AN19","v":0},{"$f":"+'c15'!AP19","v":0},{"$f":"+'c15'!AN27","v":0},{"$f":"+'c15'!AP27","v":0},{"$f":"+'c15'!AN28","v":0},{"$f":"+'c15'!AP28","v":0},{"$f":"+'c15'!AN47","v":0},{"$f":"+'c15'!AP47","v":0},{"$f":"+'c15'!AN48+'c15'!AN49+'c15'!AN50","v":0},{"$f":"+'c15'!AP48+'c15'!AP49+'c15'!AP50","v":0}]
[31,"Drogherii",0,0,0,0,0,0,0,0,0,0,0,0,0,0]
[32,"Depozite farmaceutice",{"$f":"+'c15'!AQ15","v":0},{"$f":"+'c15'!AS15","v":0},{"$f":"+'c15'!AQ16","v":0},{"$f":"+'c15'!AS16","v":0},{"$f":"+'c15'!AQ19","v":0},{"$f":"+'c15'!AS19","v":0},{"$f":"+'c15'!AQ27","v":0},{"$f":"+'c15'!AS27","v":0},{"$f":"+'c15'!AQ28","v":0},{"$f":"+'c15'!AS28","v":0},{"$f":"+'c15'!AQ47","v":0},{"$f":"+'c15'!AS47","v":0},{"$f":"+'c15'!AQ48+'c15'!AQ49+'c15'!AQ50","v":0},{"$f":"+'c15'!AS48+'c15'!AS49+'c15'!AS50","v":0}]
[33,"Policlinici",{"$f":"+'c15'!AT15","v":0},{"$f":"+'c15'!AV15","v":0},{"$f":"+'c15'!AT16","v":0},{"$f":"+'c15'!AV16","v":0},{"$f":"+'c15'!AT19","v":0},{"$f":"+'c15'!AV19","v":0},{"$f":"+'c15'!AT27","v":0},{"$f":"+'c15'!AV27","v":0},{"$f":"+'c15'!AT28","v":0},{"$f":"+'c15'!AV28","v":0},{"$f":"+'c15'!AT47","v":0},{"$f":"+'c15'!AV47","v":0},{"$f":"+'c15'!AT48+'c15'!AT49+'c15'!AT50","v":0},{"$f":"+'c15'!AV48+'c15'!AV49+'c15'!AV50","v":0}]
[34,"Centre de dializă și puncte ale centrelor de dializă",0,0,0,0,0,0,0,0,0,0,0,0,0,0]
[35," - din care: cu normă întreagă",0,0,0,0,0,0,0,0,0,0,0,0,0,0]
[36,"Centre de diagnostic şi tratament ",{"$f":"+'c15'!AW15","v":0},{"$f":"+'c15'!AY15","v":0},{"$f":"+'c15'!AW16","v":0},{"$f":"+'c15'!AY16","v":0},{"$f":"+'c15'!AW19","v":0},{"$f":"+'c15'!AY19","v":0},{"$f":"+'c15'!AW27","v":0},{"$f":"+'c15'!AY27","v":0},{"$f":"+'c15'!AW28","v":0},{"$f":"+'c15'!AY28","v":0},{"$f":"+'c15'!AW47","v":0},{"$f":"+'c15'!AY47","v":0},{"$f":"+'c15'!AW48+'c15'!AW49+'c15'!AW50","v":0},{"$f":"+'c15'!AY48+'c15'!AY49+'c15'!AY50","v":0}]
[37,"Centre medicale de specialitate",{"$f":"+'c15'!AZ15","v":0},{"$f":"+'c15'!BB15","v":0},{"$f":"+'c15'!AZ16","v":0},{"$f":"+'c15'!BB16","v":0},{"$f":"+'c15'!AZ19","v":0},{"$f":"+'c15'!BB19","v":0},{"$f":"+'c15'!AZ27","v":0},{"$f":"+'c15'!BB27","v":0},{"$f":"+'c15'!AZ28","v":0},{"$f":"+'c15'!BB28","v":0},{"$f":"+'c15'!AZ47","v":0},{"$f":"+'c15'!BB47","v":0},{"$f":"+'c15'!AZ48+'c15'!AZ49+'c15'!AZ50","v":0},{"$f":"+'c15'!BB48+'c15'!BB49+'c15'!BB50","v":0}]
[38,"Ambulatorii de specialitate ",{"$f":"+'c15'!BC15","v":0},{"$f":"+'c15'!BE15","v":0},{"$f":"+'c15'!BC16","v":0},{"$f":"+'c15'!BE16","v":0},{"$f":"+'c15'!BC19","v":0},{"$f":"+'c15'!BE19","v":0},{"$f":"+'c15'!BC27","v":0},{"$f":"+'c15'!BE27","v":0},{"$f":"+'c15'!BC28","v":0},{"$f":"+'c15'!BE28","v":0},{"$f":"+'c15'!BC47","v":0},{"$f":"+'c15'!BE47","v":0},{"$f":"+'c15'!BC48+'c15'!BC49+'c15'!BC50","v":0},{"$f":"+'c15'!BE48+'c15'!BE49+'c15'!BE50","v":0}]
[39,"Ambulatorii integrate spitalului ",{"$f":"+'c15'!BF15","v":0},{"$f":"+'c15'!BH15","v":0},{"$f":"+'c15'!BF16","v":0},{"$f":"+'c15'!BH16","v":0},{"$f":"+'c15'!BF19","v":0},{"$f":"+'c15'!BH19","v":0},{"$f":"+'c15'!BF27","v":0},{"$f":"+'c15'!BH27","v":0},{"$f":"+'c15'!BF28","v":0},{"$f":"+'c15'!BH28","v":0},{"$f":"+'c15'!BF47","v":0},{"$f":"+'c15'!BH47","v":0},{"$f":"+'c15'!BF48+'c15'!BF49+'c15'!BF50","v":0},{"$f":"+'c15'!BH48+'c15'!BH49+'c15'!BH50","v":0}]
[40,"Cabinete stomatologice şcolare ",0,0,0,0,0,0,0,0,0,0,0,0,0,0]
[41,"Cabinete stomatologice studenţeşti",0,0,0,0,0,0,0,0,0,0,0,0,0,0]
[42,"Cabinete stomatologice independente",{"$f":"+'c15'!BI15","v":0},{"$f":"+'c15'!BK15","v":0},{"$f":"+'c15'!BI16","v":0},{"$f":"+'c15'!BK16","v":0},{"$f":"+'c15'!BI19","v":0},{"$f":"+'c15'!BK19","v":0},{"$f":"+'c15'!BI27","v":0},{"$f":"+'c15'!BK27","v":0},{"$f":"+'c15'!BI28","v":0},{"$f":"+'c15'!BK28","v":0},{"$f":"+'c15'!BI47","v":0},{"$f":"+'c15'!BK47","v":0},{"$f":"+'c15'!BI48+'c15'!BI49+'c15'!BI50","v":0},{"$f":"+'c15'!BK48+'c15'!BK49+'c15'!BK50","v":0}]
[43,"Societăţi stomatologice civile medicale ",{"$f":"+'c15'!CY15","v":0},{"$f":"+'c15'!DA15","v":0},{"$f":"+'c15'!CY16","v":0},{"$f":"+'c15'!DA16","v":0},{"$f":"+'c15'!CY19","v":0},{"$f":"+'c15'!DA19","v":0},{"$f":"+'c15'!CY27","v":0},{"$f":"+'c15'!DA27","v":0},{"$f":"+'c15'!CY28","v":0},{"$f":"+'c15'!DA28","v":0},{"$f":"+'c15'!CY47","v":0},{"$f":"+'c15'!DA47","v":0},{"$f":"+'c15'!CY48+'c15'!CY49+'c15'!CY50","v":0},{"$f":"+'c15'!DA48+'c15'!DA49+'c15'!DA50","v":0}]
[44,"Cabinete medicale independente de specialitate ",{"$f":"+'c15'!BL15","v":0},{"$f":"+'c15'!BN15","v":0},{"$f":"+'c15'!BL16","v":0},{"$f":"+'c15'!BN16","v":0},{"$f":"+'c15'!BL19","v":0},{"$f":"+'c15'!BN19","v":0},{"$f":"+'c15'!BL27","v":0},{"$f":"+'c15'!BN27","v":0},{"$f":"+'c15'!BL28","v":0},{"$f":"+'c15'!BN28","v":0},{"$f":"+'c15'!BL47","v":0},{"$f":"+'c15'!BN47","v":0},{"$f":"+'c15'!BL48+'c15'!BL49+'c15'!BL50","v":0},{"$f":"+'c15'!BN48+'c15'!BN49+'c15'!BN50","v":0}]
[45,"Societăţi civile medicale de specialitate ",{"$f":"+'c15'!CV15","v":0},{"$f":"+'c15'!CX15","v":0},{"$f":"+'c15'!CV16","v":0},{"$f":"+'c15'!CX16","v":0},{"$f":"+'c15'!CV19","v":0},{"$f":"+'c15'!CX19","v":0},{"$f":"+'c15'!CV27","v":0},{"$f":"+'c15'!CX27","v":0},{"$f":"+'c15'!CV28","v":0},{"$f":"+'c15'!CX28","v":0},{"$f":"+'c15'!CV47","v":0},{"$f":"+'c15'!CX47","v":0},{"$f":"+'c15'!CV48+'c15'!CV49+'c15'!CV50","v":0},{"$f":"+'c15'!CX48+'c15'!CX49+'c15'!CX50","v":0}]
[46,"Centre de transfuzie sanguină",{"$f":"+'c15'!BU15","v":0},{"$f":"+'c15'!BW15","v":0},{"$f":"+'c15'!BU16","v":0},{"$f":"+'c15'!BW16","v":0},{"$f":"+'c15'!BU19","v":0},{"$f":"+'c15'!BW19","v":0},{"$f":"+'c15'!BU27","v":0},{"$f":"+'c15'!BW27","v":0},{"$f":"+'c15'!BU28","v":0},{"$f":"+'c15'!BW28","v":0},{"$f":"+'c15'!BU47","v":0},{"$f":"+'c15'!BW47","v":0},{"$f":"+'c15'!BU48+'c15'!BU49+'c15'!BU50","v":0},{"$f":"+'c15'!BW48+'c15'!BW49+'c15'!BW50","v":0}]
[47,"Laboratoare medicale",{"$f":"+'c15'!BX15","v":0},{"$f":"+'c15'!BZ15","v":0},{"$f":"+'c15'!BX16","v":0},{"$f":"+'c15'!BZ16","v":0},{"$f":"+'c15'!BX19","v":0},{"$f":"+'c15'!BZ19","v":0},{"$f":"+'c15'!BX27","v":0},{"$f":"+'c15'!BZ27","v":0},{"$f":"+'c15'!BX28","v":0},{"$f":"+'c15'!BZ28","v":0},{"$f":"+'c15'!BX47","v":0},{"$f":"+'c15'!BZ47","v":0},{"$f":"+'c15'!BX48+'c15'!BX49+'c15'!BX50","v":0},{"$f":"+'c15'!BZ48+'c15'!BZ49+'c15'!BZ50","v":0}]
[48,"Laboratoare de tehnică dentară",{"$f":"+'c15'!CA15","v":0},{"$f":"+'c15'!CC15","v":0},{"$f":"+'c15'!CA16","v":0},{"$f":"+'c15'!CC16","v":0},{"$f":"+'c15'!CA19","v":0},{"$f":"+'c15'!CC19","v":0},{"$f":"+'c15'!CA27","v":0},{"$f":"+'c15'!CC27","v":0},{"$f":"+'c15'!CA28","v":0},{"$f":"+'c15'!CC28","v":0},{"$f":"+'c15'!CA47","v":0},{"$f":"+'c15'!CC47","v":0},{"$f":"+'c15'!CA48+'c15'!CA49+'c15'!CA50","v":0},{"$f":"+'c15'!CC48+'c15'!CC49+'c15'!CC50","v":0}]
[49,"Unități de ambulanță, transportul pacienților și SMURD",{"$f":"+'c15'!CM15","v":0},{"$f":"+'c15'!CO15","v":0},{"$f":"+'c15'!CM16","v":0},{"$f":"+'c15'!CO16","v":0},{"$f":"+'c15'!CM19","v":0},{"$f":"+'c15'!CO19","v":0},{"$f":"+'c15'!CM27","v":0},{"$f":"+'c15'!CO27","v":0},{"$f":"+'c15'!CM28","v":0},{"$f":"+'c15'!CO28","v":0},{"$f":"+'c15'!CM47","v":0},{"$f":"+'c15'!CO47","v":0},{"$f":"+'c15'!CM48+'c15'!CM49+'c15'!CM50","v":0},{"$f":"+'c15'!CO48+'c15'!CO49+'c15'!CO50","v":0}]
[50,"Alte tipuri de cabinete medicale",0,0,0,0,0,0,0,0,0,0,0,0,0,0]
[51,"Unitati rezidentiale pentru persoanele cu dizabilități",0,0,0,0,0,0,0,0,0,0,0,0,0,0]
[52,"Centre de zi pentru persoanele cu dizabilități",0,0,0,0,0,0,0,0,0,0,0,0,0,0]
[53,"Unități rezidențiale pentru persoanele vârstnice care oferă îngriji medicale în cadrul unității",0,0,0,0,0,0,0,0,0,0,0,0,0,0]
[54,"Alte unități de asistență socială care furnizează îngrijiri medicale",0,0,0,0,0,0,0,0,0,0,0,0,0,0]
[55,"Institute şi instituţii fără paturi *",{"$f":"+'c15'!CD15+'c15'!CG15+'c15'!CP15","v":0},{"$f":"+'c15'!CF15+'c15'!CI15+'c15'!CR15","v":0},{"$f":"+'c15'!CD16+'c15'!CG16+'c15'!CP16","v":0},{"$f":"+'c15'!CF16+'c15'!CI16+'c15'!CR16","v":0},{"$f":"+'c15'!CD19+'c15'!CG19+'c15'!CP19","v":0},{"$f":"+'c15'!CF19+'c15'!CI19+'c15'!CR19","v":0},{"$f":"+'c15'!CD27+'c15'!CG27+'c15'!CP27","v":0},{"$f":"+'c15'!CF27+'c15'!CI27+'c15'!CR27","v":0},{"$f":"+'c15'!CD28+'c15'!CG28+'c15'!CP28","v":0},{"$f":"+'c15'!CF28+'c15'!CI28+'c15'!CR28","v":0},{"$f":"+'c15'!CD47+'c15'!CG47+'c15'!CP47","v":0},{"$f":"+'c15'!CF47+'c15'!CI47+'c15'!CR47","v":0},{"$f":"+'c15'!CD48+'c15'!CD49+'c15'!CD50+'c15'!CG48+'c15'!CG49+'c15'!CG50+'c15'!CP48+'c15'!CP49+'c15'!CP50","v":0},{"$f":"+'c15'!CF48+'c15'!CF49+'c15'!CF50+'c15'!CI48+'c15'!CI49+'c15'!CI50+'c15'!CR48+'c15'!CR49+'c15'!CR50","v":0}]
[56,"Alte unități **",0,0,0,0,0,0,0,0,0,0,0,0,0,0]
["Cap.9  Numărul medicilor (exclusiv stomatologi), după specialitatea medicală în care își desfășoară activitatea",null,null,null,{"$f":"IF(C392=E240,\"OK\",\"Err\")","v":"OK"},{"$f":"IF(D392=F240,\"OK\",\"Err\")","v":"OK"},{"$f":"IF(E243=G392,\"OK\",\"Err\")","v":"OK"},{"$f":"IF(F243=H392,\"OK\",\"Err\")","v":"OK"}]
["Nr. Crt.","Specialitatea medicală","Total","din care: femei","din total:"]
[]
[null,null,null,null,"Medici pentru copii",null,"Medici rezidenți"]
[null,null,null,null,"Total","din care: femei","Total","din care: femei"]
["A","B","1","2",3,4,5,6]
["1.  ","Total, din care:",{"$f":"SUM(C393:C447)","v":0},0,0,0,0,0]
["2.  ","Alergologie şi imunologie clinică",{"$f":"+'c15'!D111","v":0},{"$f":"+'c15'!F111","v":0},{"$f":"+'c15'!J111","v":0},{"$f":"+'c15'!L111","v":0},{"$f":"+'c15'!G111","v":0},{"$f":"+'c15'!I111","v":0}]
["3.  ","A.T.I.",{"$f":"+'c15'!D112","v":0},{"$f":"+'c15'!F112","v":0},{"$f":"+'c15'!J112","v":0},{"$f":"+'c15'!L112","v":0},{"$f":"+'c15'!G112","v":0},{"$f":"+'c15'!I112","v":0}]
["4.  ","Boli infecţioase",{"$f":"+'c15'!D113","v":0},{"$f":"+'c15'!F113","v":0},{"$f":"+'c15'!J113","v":0},{"$f":"+'c15'!L113","v":0},{"$f":"+'c15'!G113","v":0},{"$f":"+'c15'!I113","v":0}]
["5.  ","Cardiologie",{"$f":"+'c15'!D114","v":0},{"$f":"+'c15'!F114","v":0},{"$f":"+'c15'!J114","v":0},{"$f":"+'c15'!L114","v":0},{"$f":"+'c15'!G114","v":0},{"$f":"+'c15'!I114","v":0}]
["6.  ","Dermatovenerologie",{"$f":"+'c15'!D115","v":0},{"$f":"+'c15'!F115","v":0},{"$f":"+'c15'!J115","v":0},{"$f":"+'c15'!L115","v":0},{"$f":"+'c15'!G115","v":0},{"$f":"+'c15'!I115","v":0}]
["7.  ","Diabet zaharat, nutriţie şi boli metabolice",{"$f":"+'c15'!D116","v":0},{"$f":"+'c15'!F116","v":0},{"$f":"+'c15'!J116","v":0},{"$f":"+'c15'!L116","v":0},{"$f":"+'c15'!G116","v":0},{"$f":"+'c15'!I116","v":0}]
["8.  ","Endocrinologie",{"$f":"+'c15'!D117","v":0},{"$f":"+'c15'!F117","v":0},{"$f":"+'c15'!J117","v":0},{"$f":"+'c15'!L117","v":0},{"$f":"+'c15'!G117","v":0},{"$f":"+'c15'!I117","v":0}]
["9.  ","Expertiza medicală a capacităţii de muncă",{"$f":"+'c15'!D118","v":0},{"$f":"+'c15'!F118","v":0},{"$f":"+'c15'!J118","v":0},{"$f":"+'c15'!L118","v":0},{"$f":"+'c15'!G118","v":0},{"$f":"+'c15'!I118","v":0}]
["10.   ","Farmacologie clinică",{"$f":"+'c15'!D119","v":0},{"$f":"+'c15'!F119","v":0},{"$f":"+'c15'!J119","v":0},{"$f":"+'c15'!L119","v":0},{"$f":"+'c15'!G119","v":0},{"$f":"+'c15'!I119","v":0}]
["11.   ","Gastroenterologie",{"$f":"+'c15'!D120","v":0},{"$f":"+'c15'!F120","v":0},{"$f":"+'c15'!J120","v":0},{"$f":"+'c15'!L120","v":0},{"$f":"+'c15'!G120","v":0},{"$f":"+'c15'!I120","v":0}]
["12.   ","Genetică medicală",{"$f":"+'c15'!D121","v":0},{"$f":"+'c15'!F121","v":0},{"$f":"+'c15'!J121","v":0},{"$f":"+'c15'!L121","v":0},{"$f":"+'c15'!G121","v":0},{"$f":"+'c15'!I121","v":0}]
["13.   ","Geriatrie şi gerontologie",{"$f":"+'c15'!D122","v":0},{"$f":"+'c15'!F122","v":0},{"$f":"+'c15'!J122","v":0},{"$f":"+'c15'!L122","v":0},{"$f":"+'c15'!G122","v":0},{"$f":"+'c15'!I122","v":0}]
["14.   ","Hematologie",{"$f":"+'c15'!D123","v":0},{"$f":"+'c15'!F123","v":0},{"$f":"+'c15'!J123","v":0},{"$f":"+'c15'!L123","v":0},{"$f":"+'c15'!G123","v":0},{"$f":"+'c15'!I123","v":0}]
["15.   ","Medicină de familie",{"$f":"+'c15'!D124","v":0},{"$f":"+'c15'!F124","v":0},{"$f":"+'c15'!J124","v":0},{"$f":"+'c15'!L124","v":0},{"$f":"+'c15'!G124","v":0},{"$f":"+'c15'!I124","v":0},{"$f":"IF(E241=C406,\"OK\",\"Err\")","v":"OK"},{"$f":"IF(F241=D406,\"OK\",\"Err\")","v":"OK"}]
["16.   ","Medicină de urgenţă",{"$f":"+'c15'!D125","v":0},{"$f":"+'c15'!F125","v":0},{"$f":"+'c15'!J125","v":0},{"$f":"+'c15'!L125","v":0},{"$f":"+'c15'!G125","v":0},{"$f":"+'c15'!I125","v":0}]
["17.   ","Medicină internă",{"$f":"+'c15'!D126","v":0},{"$f":"+'c15'!F126","v":0},{"$f":"+'c15'!J126","v":0},{"$f":"+'c15'!L126","v":0},{"$f":"+'c15'!G126","v":0},{"$f":"+'c15'!I126","v":0}]
["18.   ","Medicină generală",{"$f":"+'c15'!D127","v":0},{"$f":"+'c15'!F127","v":0},{"$f":"+'c15'!J127","v":0},{"$f":"+'c15'!L127","v":0},{"$f":"+'c15'!G127","v":0},{"$f":"+'c15'!I127","v":0}]
["19.   ","Medicina muncii",{"$f":"+'c15'!D128","v":0},{"$f":"+'c15'!F128","v":0},{"$f":"+'c15'!J128","v":0},{"$f":"+'c15'!L128","v":0},{"$f":"+'c15'!G128","v":0},{"$f":"+'c15'!I128","v":0}]
["20.","Medicină sportivă",{"$f":"+'c15'!D129","v":0},{"$f":"+'c15'!F129","v":0},{"$f":"+'c15'!J129","v":0},{"$f":"+'c15'!L129","v":0},{"$f":"+'c15'!G129","v":0},{"$f":"+'c15'!I129","v":0}]
["21.","Nefrologie",{"$f":"+'c15'!D130","v":0},{"$f":"+'c15'!F130","v":0},{"$f":"+'c15'!J130","v":0},{"$f":"+'c15'!L130","v":0},{"$f":"+'c15'!G130","v":0},{"$f":"+'c15'!I130","v":0}]
["22.","Neonatologie",{"$f":"+'c15'!D131","v":0},{"$f":"+'c15'!F131","v":0},{"$f":"+'c15'!J131","v":0},{"$f":"+'c15'!L131","v":0},{"$f":"+'c15'!G131","v":0},{"$f":"+'c15'!I131","v":0}]
["23.","Neurologie",{"$f":"+'c15'!D132","v":0},{"$f":"+'c15'!F132","v":0},{"$f":"+'c15'!J132","v":0},{"$f":"+'c15'!L132","v":0},{"$f":"+'c15'!G132","v":0},{"$f":"+'c15'!I132","v":0}]
["24.","Neurologie pediatrică",{"$f":"+'c15'!D133","v":0},{"$f":"+'c15'!F133","v":0},{"$f":"+'c15'!J133","v":0},{"$f":"+'c15'!L133","v":0},{"$f":"+'c15'!G133","v":0},{"$f":"+'c15'!I133","v":0}]
["25.","Oncologie medicală",{"$f":"+'c15'!D134","v":0},{"$f":"+'c15'!F134","v":0},{"$f":"+'c15'!J134","v":0},{"$f":"+'c15'!L134","v":0},{"$f":"+'c15'!G134","v":0},{"$f":"+'c15'!I134","v":0}]
["26.","Pediatrie",{"$f":"+'c15'!D135","v":0},{"$f":"+'c15'!F135","v":0},{"$f":"+'c15'!J135","v":0},{"$f":"+'c15'!L135","v":0},{"$f":"+'c15'!G135","v":0},{"$f":"+'c15'!I135","v":0}]
["27.","Pneumologie",{"$f":"+'c15'!D136","v":0},{"$f":"+'c15'!F136","v":0},{"$f":"+'c15'!J136","v":0},{"$f":"+'c15'!L136","v":0},{"$f":"+'c15'!G136","v":0},{"$f":"+'c15'!I136","v":0}]
["28.","Psihiatrie ",{"$f":"+'c15'!D137","v":0},{"$f":"+'c15'!F137","v":0},{"$f":"+'c15'!J137","v":0},{"$f":"+'c15'!L137","v":0},{"$f":"+'c15'!G137","v":0},{"$f":"+'c15'!I137","v":0}]
["29.","Psihiatrie pediatrică ",{"$f":"+'c15'!D138","v":0},{"$f":"+'c15'!F138","v":0},{"$f":"+'c15'!J138","v":0},{"$f":"+'c15'!L138","v":0},{"$f":"+'c15'!G138","v":0},{"$f":"+'c15'!I138","v":0}]
["30.","Radioterapie",{"$f":"+'c15'!D139","v":0},{"$f":"+'c15'!F139","v":0},{"$f":"+'c15'!J139","v":0},{"$f":"+'c15'!L139","v":0},{"$f":"+'c15'!G139","v":0},{"$f":"+'c15'!I139","v":0}]
["31.","Recuperare, medicină fizică şi balneologie",{"$f":"+'c15'!D140","v":0},{"$f":"+'c15'!F140","v":0},{"$f":"+'c15'!J140","v":0},{"$f":"+'c15'!L140","v":0},{"$f":"+'c15'!G140","v":0},{"$f":"+'c15'!I140","v":0}]
["32.","Reabilitare medicală",{"$f":"+'c15'!D141","v":0},{"$f":"+'c15'!F141","v":0},{"$f":"+'c15'!J141","v":0},{"$f":"+'c15'!L141","v":0},{"$f":"+'c15'!G141","v":0},{"$f":"+'c15'!I141","v":0}]
["33.","Reumatologie",{"$f":"+'c15'!D142","v":0},{"$f":"+'c15'!F142","v":0},{"$f":"+'c15'!J142","v":0},{"$f":"+'c15'!L142","v":0},{"$f":"+'c15'!G142","v":0},{"$f":"+'c15'!I142","v":0}]
["34.","Chirurgie cardiovasculară",{"$f":"+'c15'!D143","v":0},{"$f":"+'c15'!F143","v":0},{"$f":"+'c15'!J143","v":0},{"$f":"+'c15'!L143","v":0},{"$f":"+'c15'!G143","v":0},{"$f":"+'c15'!I143","v":0}]
["35.","Chirurgie generală",{"$f":"+'c15'!D144","v":0},{"$f":"+'c15'!F144","v":0},{"$f":"+'c15'!J144","v":0},{"$f":"+'c15'!L144","v":0},{"$f":"+'c15'!G144","v":0},{"$f":"+'c15'!I144","v":0}]
["36.","Chirurgie orală şi maxilo- facială",{"$f":"+'c15'!D145","v":0},{"$f":"+'c15'!F145","v":0},{"$f":"+'c15'!J145","v":0},{"$f":"+'c15'!L145","v":0},{"$f":"+'c15'!G145","v":0},{"$f":"+'c15'!I145","v":0}]
["37.","Chirurgie pediatrică",{"$f":"+'c15'!D146","v":0},{"$f":"+'c15'!F146","v":0},{"$f":"+'c15'!J146","v":0},{"$f":"+'c15'!L146","v":0},{"$f":"+'c15'!G146","v":0},{"$f":"+'c15'!I146","v":0}]
["38.","Chirurgie plastică-microchir. reconstructivă",{"$f":"+'c15'!D147","v":0},{"$f":"+'c15'!F147","v":0},{"$f":"+'c15'!J147","v":0},{"$f":"+'c15'!L147","v":0},{"$f":"+'c15'!G147","v":0},{"$f":"+'c15'!I147","v":0}]
["39.","Chirurgie plastică, estetică și microchirurgie reconstructivă",{"$f":"+'c15'!D148","v":0},{"$f":"+'c15'!F148","v":0},{"$f":"+'c15'!J148","v":0},{"$f":"+'c15'!L148","v":0},{"$f":"+'c15'!G148","v":0},{"$f":"+'c15'!I148","v":0}]
["40.","Chirurgie toracică",{"$f":"+'c15'!D149","v":0},{"$f":"+'c15'!F149","v":0},{"$f":"+'c15'!J149","v":0},{"$f":"+'c15'!L149","v":0},{"$f":"+'c15'!G149","v":0},{"$f":"+'c15'!I149","v":0}]
["41.","Chirurgie vasculară",{"$f":"+'c15'!D150","v":0},{"$f":"+'c15'!F150","v":0},{"$f":"+'c15'!J150","v":0},{"$f":"+'c15'!L150","v":0},{"$f":"+'c15'!G150","v":0},{"$f":"+'c15'!I150","v":0}]
["42."," Neurochirurgie",{"$f":"+'c15'!D151","v":0},{"$f":"+'c15'!F151","v":0},{"$f":"+'c15'!J151","v":0},{"$f":"+'c15'!L151","v":0},{"$f":"+'c15'!G151","v":0},{"$f":"+'c15'!I151","v":0}]
["43.","Obstetrică- ginecologie",{"$f":"+'c15'!D152","v":0},{"$f":"+'c15'!F152","v":0},{"$f":"+'c15'!J152","v":0},{"$f":"+'c15'!L152","v":0},{"$f":"+'c15'!G152","v":0},{"$f":"+'c15'!I152","v":0}]
["44.","Oftalmologie",{"$f":"+'c15'!D153","v":0},{"$f":"+'c15'!F153","v":0},{"$f":"+'c15'!J153","v":0},{"$f":"+'c15'!L153","v":0},{"$f":"+'c15'!G153","v":0},{"$f":"+'c15'!I153","v":0}]
["45.","Ortopedie şi traumatologie",{"$f":"+'c15'!D155+'c15'!D154","v":0},{"$f":"+'c15'!F155+'c15'!F154","v":0},{"$f":"+'c15'!J155+'c15'!J154","v":0},{"$f":"+'c15'!L155+'c15'!L154","v":0},{"$f":"+'c15'!G155+'c15'!G154","v":0},{"$f":"+'c15'!I155+'c15'!I154","v":0}]
["46.","O.R.L.",{"$f":"+'c15'!D156","v":0},{"$f":"+'c15'!F156","v":0},{"$f":"+'c15'!J156","v":0},{"$f":"+'c15'!L156","v":0},{"$f":"+'c15'!G156","v":0},{"$f":"+'c15'!I156","v":0}]
["47."," Urologie",{"$f":"+'c15'!D157","v":0},{"$f":"+'c15'!F157","v":0},{"$f":"+'c15'!J157","v":0},{"$f":"+'c15'!L157","v":0},{"$f":"+'c15'!G157","v":0},{"$f":"+'c15'!I157","v":0}]
["48.","Anatomie patologică",{"$f":"+'c15'!D158","v":0},{"$f":"+'c15'!F158","v":0},{"$f":"+'c15'!J158","v":0},{"$f":"+'c15'!L158","v":0},{"$f":"+'c15'!G158","v":0},{"$f":"+'c15'!I158","v":0}]
["49.","Epidemiologie",{"$f":"+'c15'!D159","v":0},{"$f":"+'c15'!F159","v":0},{"$f":"+'c15'!J159","v":0},{"$f":"+'c15'!L159","v":0},{"$f":"+'c15'!G159","v":0},{"$f":"+'c15'!I159","v":0}]
["50.","Igienă",{"$f":"+'c15'!D160","v":0},{"$f":"+'c15'!F160","v":0},{"$f":"+'c15'!J160","v":0},{"$f":"+'c15'!L160","v":0},{"$f":"+'c15'!G160","v":0},{"$f":"+'c15'!I160","v":0}]
["51.","Medicină de laborator",{"$f":"+'c15'!D161","v":0},{"$f":"+'c15'!F161","v":0},{"$f":"+'c15'!J161","v":0},{"$f":"+'c15'!L161","v":0},{"$f":"+'c15'!G161","v":0},{"$f":"+'c15'!I161","v":0}]
["52."," Medicină legală",{"$f":"+'c15'!D162","v":0},{"$f":"+'c15'!F162","v":0},{"$f":"+'c15'!J162","v":0},{"$f":"+'c15'!L162","v":0},{"$f":"+'c15'!G162","v":0},{"$f":"+'c15'!I162","v":0}]
["53."," Medicină nucleară",{"$f":"+'c15'!D163","v":0},{"$f":"+'c15'!F163","v":0},{"$f":"+'c15'!J163","v":0},{"$f":"+'c15'!L163","v":0},{"$f":"+'c15'!G163","v":0},{"$f":"+'c15'!I163","v":0}]
["54.","Radiologie – imagistică medicală",{"$f":"+'c15'!D164","v":0},{"$f":"+'c15'!F164","v":0},{"$f":"+'c15'!J164","v":0},{"$f":"+'c15'!L164","v":0},{"$f":"+'c15'!G164","v":0},{"$f":"+'c15'!I164","v":0}]
["55.","Sănătate publică şi management",{"$f":"+'c15'!D165","v":0},{"$f":"+'c15'!F165","v":0},{"$f":"+'c15'!J165","v":0},{"$f":"+'c15'!L165","v":0},{"$f":"+'c15'!G165","v":0},{"$f":"+'c15'!I165","v":0}]
["56.","Altă specialitate medicală"]
["Cap.11 Asistenţa medicală de urgenţă prespitalicească, primul ajutor și transport sanitar"]
["Nr. Crt.","Numărul mijloacelor de intervenție pentru asistența medicală de urgenţă prespitalicească, primul ajutor și transport sanitar","Număr Solicitări",null,null,"Număr de pacienţi/persoane"]
[null,null,"Total","din care: "]
[null,null,null,"rezolvate","alte situații","Transportaţi","Primul ajutor acordat la locul solicitării fără transportul pacienților"]
["A","1",2,3,4,5,6]
["1.",{"$f":"+'c7'!A13","v":0},{"$f":"+'c7'!D13","v":0},{"$f":"+'c7'!E13","v":0},{"$f":"+'c7'!F13","v":0},{"$f":"+'c7'!G13","v":0},{"$f":"+'c7'!H13","v":0}]
["Cap.12a Alocarea cheltuielilor din unitatile sanitare cu paturi si din unitatile din sfera asistentei sociale in care se furnizeaza si ingrijiri medicale, in anul financiar 2023, dupa sursele de finantare/venituri, pe categorii de cheltuieli si tipuri de unitati",null,null,null,null,null,null,null,null,null,null,null,"in mii lei"]
["Nr. rând","Tipuri de unităţi sanitare","Cheltuieli curente","din cheltuieli curente (col.1) pe surse de finanțare",null,null,null,null,null,null,null,"Cheltuieli de capital"]
[null,null,null,"Bugetul de stat","Bugetele locale și județene","Fondul Național Unic de Asigurări Sociale de Sănătate","Fonduri proprii",null,null,"Societăți private de asigurări","Angajatori, pt. controale periodice ale personalului propriu","Total","din care: din fonduri publice"]
[null,null,null,null,null,null,"Total","din care:"]
[null,null,null,null,null,null,null,"plați directe de la pacienți","donatii"]
["A","B",1,2,3,4,5,6,7,8,9,10,11]
["1.    ","Spitale (inclusiv institute cu paturi de spital)",{"$f":"SUM(D460:G460)+SUM(J460:K460)","v":0},0,0,0,0,0,0,0,0,0,0]
["2.    ","Unități sanitare (inclusiv unități asimilate spitalelor) numai cu internare de zi*",{"$f":"SUM(D461:G461)+SUM(J461:K461)","v":0},0,0,0,0,0,0,0,0,0,0]
["3.    ","Centre de sănătate cu paturi de spital",{"$f":"SUM(D462:G462)+SUM(J462:K462)","v":0},0,0,0,0,0,0,0,0,0,0]
["4.    ","Centre de sănătate multifuncționale",0,0,0,0,0,0,0,0,0,0,0]
["5.    ","Unităţi medico-sociale",0,0,0,0,0,0,0,0,0,0,0]
["6.    ","Sanatorii TBC",0,0,0,0,0,0,0,0,0,0,0]
["7.    ","Preventorii",0,0,0,0,0,0,0,0,0,0,0]
["8.    ","Sanatorii de nevroze sau de neuropsihiatrie",0,0,0,0,0,0,0,0,0,0,0]
["9.    ","Sanatorii balneare",0,0,0,0,0,0,0,0,0,0,0]
["10.    ","Centre de dializă și puncte ale centrelor de dializă",0,0,0,0,0,0,0,0,0,0,0]
["11.    ","Unitati rezidentiale pentru persoanele cu dizabilități",0,0,0,0,0,0,0,0,0,0,0]
["12.    ","Unități rezidențiale pentru persoanele vârstnice care oferă îngriji medicale în cadrul unității",0,0,0,0,0,0,0,0,0,0,0]
["Cap.12b Alocarea cheltuielilor din unitatile sanitare si din unitatile din sfera asistentei sociale in care se furnizeaza si ingrijiri medicale, care acorda asistenta medicala ambulatorie,in anul financiar 2023, dupa sursele de finantare/venituri, pe  categorii de cheltuieli si tipuri de unitati",null,null,null,null,null,null,null,null,null,null,null,"in mii lei"]
["Nr. rând","Tipuri de unităţi sanitare","Cheltuieli curente","din cheltuieli curente (col.2) pe surse de finantare/ venituri, de la:",null,null,null,null,null,null,null,"Cheltuieli de capital"]
[null,null,null,"Bugetul de stat","Bugetele locale și județene","Fondul Național Unic de Asigurări Sociale de Sănătate","Fonduri proprii",null,null,"Societăți private de asigurări","Angajatori, pt. controale periodice ale personalului propriu","Total","din care din fonduri publice"]
[null,null,null,null,null,null,"Total","din care:"]
[null,null,null,null,null,null,null,"plați directe de la pacienți","donații"]
["A","B",1,2,3,4,5,6,7,8,9,10,11]
["1.    ","Centre de sănătate",{"$f":"SUM(D478:G478)+SUM(J478:K478)","v":0},0,0,0,0,0,0,0,0,0,0]
["2.    ","Centre de sănătate mintală",{"$f":"SUM(D479:G479)+SUM(J479:K479)","v":0},0,0,0,0,0,0,0,0,0,0]
["3.    ","Dispensare medicale ",0,0,0,0,0,0,0,0,0,0,0]
["4.    ","Cabinete medicale şcolare ",0,0,0,0,0,0,0,0,0,0,0]
["5.    ","Cabinete medicale studenţeşti",0,0,0,0,0,0,0,0,0,0,0]
["6.    ","Cabinete independente de medicale de medicină generală",0,0,0,0,0,0,0,0,0,0,0]
["7.    ","Cabinete independente de medicină de familie",0,0,0,0,0,0,0,0,0,0,0]
["8.    ","Societăţi medicale civile 2)",0,0,0,0,0,0,0,0,0,0,0]
["9.    ","Farmacii",0,0,0,0,0,0,0,0,0,0,0]
["10.    ","Puncte de lucru ale farmaciilor",0,0,0,0,0,0,0,0,0,0,0]
["11.    ","Drogherii",0,0,0,0,0,0,0,0,0,0,0]
["12.    ","Depozite farmaceutice",0,0,0,0,0,0,0,0,0,0,0]
["13.    ","Policlinici",0,0,0,0,0,0,0,0,0,0,0]
["14.    ","Centre de diagnostic şi tratament",0,0,0,0,0,0,0,0,0,0,0]
["15.    ","Centre medicale de specialitate",0,0,0,0,0,0,0,0,0,0,0]
["16.    ","Ambulatorii de specialitate",0,0,0,0,0,0,0,0,0,0,0]
["17.    ","Ambulatorii integrate spitalului",0,0,0,0,0,0,0,0,0,0,0]
["18.    ","Cabinete stomatologice şcolare ",0,0,0,0,0,0,0,0,0,0,0]
["19.    ","Cabinete stomatologice studenţeşti",0,0,0,0,0,0,0,0,0,0,0]
["20.    ","Cabinete stomatologice independente",0,0,0,0,0,0,0,0,0,0,0]
["21.    ","Societăţi stomatologice civile medicale ",0,0,0,0,0,0,0,0,0,0,0]
["22.    ","Cabinete medicale independente de specialitate",0,0,0,0,0,0,0,0,0,0,0]
["23.    ","Societăţi civile medicale de specialitate",0,0,0,0,0,0,0,0,0,0,0]
["24.    ","Centre de transfuzie sanguină",0,0,0,0,0,0,0,0,0,0,0]
["25.    ","Laboratoare medicale",0,0,0,0,0,0,0,0,0,0,0]
["26.    ","Laboratoare de tehnică dentară",0,0,0,0,0,0,0,0,0,0,0]
["27.    ","Unități de ambulanță, transportul pacienților și SMURD",0,0,0,0,0,0,0,0,0,0,0]
["28.    ","Alte tipuri de cabinete medicale",0,0,0,0,0,0,0,0,0,0,0]
["29.    ","Centre de zi pentru persoanele cu dizabilități",0,0,0,0,0,0,0,0,0,0,0]
["30.    ","Alte unități de asistență socială care furnizează îngrijiri medicale",{"$f":"SUM(D507:G507)+SUM(J507:K507)","v":0},0,0,0,0,0,0,0,0,0,0]
["31.    ","Institute şi instituţii fără paturi *",0,0,0,0,0,0,0,0,0,0,0]
["32.    ","Alte unități **",{"$f":"SUM(D509:G509)+SUM(J509:K509)","v":0},0,0,0,0,0,0,0,0,0,0]
["Cap.13a Alocarea cheltuielilor din unitățile sanitare cu paturi și din unitatile din sfera asistentei sociale in care se furnizeaza si ingrijiri medicale, in anul financiar 2023, pe tipuri de unitati si servicii",null,null,null,null,null,null,null,null,null,null,"in mii lei"]
["Nr. rând","Tipuri de unităţi sanitare","Cheltuieli curente din cap.12a, col.1","din care pe categorii principale de servicii prestate"]
[null,null,null,"servicii medicale de:",null,null,null,null,null,"servicii medicale paraclinice",null,"medicamente"]
[null,null,null,"spit.continuă pt.cazuri acute și cronice","spitalizare de zi","recuperare, reabilitare","ambulanța și transportul pacienților","medicina muncii","prevenție și sănătate publică","Total","din care: diagnos- ticare imagistică"]
[]
["A","B",1,2,3,4,5,6,7,8,9,10]
["1.    ","Spitale (inclusiv institute cu paturi de spital)",0,0,0,0,0,0,0,0,0,0]
["2.    ","Unități sanitare (inclusiv unități asimilate spitalelor) numai cu internare de zi*",0,0,0,0,0,0,0,0,0,0]
["3.    ","Centre de sănătate cu paturi de spital",0,0,0,0,0,0,0,0,0,0]
["4.    ","Centre de sănătate multifuncționale",0,0,0,0,0,0,0,0,0,0]
["5.    ","Unităţi medico-sociale",0,0,0,0,0,0,0,0,0,0]
["6.    ","Sanatorii TBC",0,0,0,0,0,0,0,0,0,0]
["7.    ","Preventorii",0,0,0,0,0,0,0,0,0,0]
["8.    ","Sanatorii de nevroze sau de neuropsihiatrie",0,0,0,0,0,0,0,0,0,0]
["9.    ","Sanatorii balneare",0,0,0,0,0,0,0,0,0,0]
["10.    ","Centre de dializă și puncte ale centrelor de dializă",0,0,0,0,0,0,0,0,0,0]
["11.    ","Unități rezidențiale pentru persoanele cu dizabilități",0,0,0,0,0,0,0,0,0,0]
["12.    ","Unități rezidențiale pentru persoanele vârstnice care oferă îngriji medicale în cadrul unității",0,0,0,0,0,0,0,0,0,0]
["Cap.13b Alocarea cheltuielilor din unitatile sanitare si din unitatile din sfera asistentei sociale in care se furnizeaza si ingrijiri medicale, care acorda asistenta medicala ambulatorie, in anul financiar 2023, pe tipuri de unitati si servicii",null,null,null,null,null,null,null,null,null,null,null,null,"in mii lei"]
["Nr. rând","Tipuri de unităţi sanitare","Cheltuieli curente (din cap.12b col.1)","din care: pe categorii principale de servicii prestate"]
[null,null,null,"medicale primare","medicamente","medicale de specialitate","medicale  Stomatologice","medicale de recuperare-reabilitare","medicale de îngrijire la domiciliu","prevenție și sănătate publică","ambulanţă şi transposturl pacienţilor","medicina muncii","medicale paraclinice"]
[null,null,null,null,null,null,null,null,null,null,null,null,"Total","din care: diagnos- ticare imagistică"]
["A","B",1,2,3,4,5,6,7,8,9,10,11,12]
["1.    ","Centre de sănătate",0,0,0,0,0,0,0,0,0,0,0,0]
["2.    ","Centre de sănătate mintală",0,0,0,0,0,0,0,0,0,0,0,0]
["3.    ","Dispensare medicale ",0,0,0,0,0,0,0,0,0,0,0,0]
["4.    ","Cabinete medicale şcolare ",0,0,0,0,0,0,0,0,0,0,0,0]
["5.    ","Cabinete medicale studenţeşti",0,0,0,0,0,0,0,0,0,0,0,0]
["6.    ","Cabinete independente de medicină generală",0,0,0,0,0,0,0,0,0,0,0,0]
["7.    ","Cabinete independente de medicină de familie",0,0,0,0,0,0,0,0,0,0,0,0]
["8.    ","Societăţi medicale civile",0,0,0,0,0,0,0,0,0,0,0,0]
["9.    ","Farmacii",0,0,0,0,0,0,0,0,0,0,0,0]
["10.    ","Puncte de lucru ale farmaciilor",0,0,0,0,0,0,0,0,0,0,0,0]
["11.    ","Drogherii",0,0,0,0,0,0,0,0,0,0,0,0]
["12.    ","Depozite farmaceutice",0,0,0,0,0,0,0,0,0,0,0,0]
["13.    ","Policlinici",0,0,0,0,0,0,0,0,0,0,0,0]
["14.    ","Centre de diagnostic şi tratament",0,0,0,0,0,0,0,0,0,0,0,0]
["15.    ","Centre medicale de specialitate",0,0,0,0,0,0,0,0,0,0,0,0]
["16.    ","Ambulatorii de specialitate",0,0,0,0,0,0,0,0,0,0,0,0]
["17.    ","Ambulatorii integrate spitalului",0,0,0,0,0,0,0,0,0,0,0,0]
["18.    ","Cabinete stomatologice şcolare ",0,0,0,0,0,0,0,0,0,0,0,0]
["19.    ","Cabinete stomatologice studenţeşti",0,0,0,0,0,0,0,0,0,0,0,0]
["20.    ","Cabinete stomatologice independente",0,0,0,0,0,0,0,0,0,0,0,0]
["21.    ","Societăţi stomatologice civile medicale ",0,0,0,0,0,0,0,0,0,0,0,0]
["22.    ","Cabinete medicale independente de specialitate",0,0,0,0,0,0,0,0,0,0,0,0]
["23.    ","Societăţi civile medicale de specialitate",0,0,0,0,0,0,0,0,0,0,0,0]
["24.    ","Centre de transfuzie sanguină",0,0,0,0,0,0,0,0,0,0,0,0]
["25.    ","Laboratoare medicale",0,0,0,0,0,0,0,0,0,0,0,0]
["26.    ","Laboratoare de tehnică dentară",0,0,0,0,0,0,0,0,0,0,0,0]
["27.    ","Unități de ambulanță, transportul pacienților și SMURD",0,0,0,0,0,0,0,0,0,0,0,0]
["28.    ","Alte tipuri de cabinete medicale",0,0,0,0,0,0,0,0,0,0,0,0]
["29.    ","Centre de zi pentru persoanele cu dizabilități",0,0,0,0,0,0,0,0,0,0,0,0]
["30.    ","Alte unități de asistență socială care furnizează îngrijiri medicale",0,0,0,0,0,0,0,0,0,0,0,0]
["31.    ","Institute şi instituţii fără paturi *",0,0,0,0,0,0,0,0,0,0,0,0]
["32.    ","Alte unități **",0,0,0,0,0,0,0,0,0,0,0,0]

{"sheet":"c2Sp_Sext_cab_spital","index":1,"n_rows":289,"n_cols":35,"rows_kept":289,"cut":false,"hidden":false,"merged":[[31,11,32,11],[31,12,31,13],[34,0,34,1],[24,0,25,0],[26,0,27,0],[31,0,32,1],[31,2,32,2],[31,3,31,4],[31,5,32,5],[31,6,31,7],[31,8,32,8],[31,9,31,10],[23,0,23,1],[44,4,46,4],[115,0,116,0],[115,1,116,1],[115,2,115,4],[59,2,59,3],[59,4,59,5],[80,0,83,0],[44,5,46,5],[45,1,46,1],[45,2,45,3],[52,0,53,0],[35,0,36,0],[37,0,38,0],[39,0,40,0],[44,0,46,0],[13,0,13,1],[14,0,15,0],[16,0,17,0],[18,0,18,1],[21,0,21,1],[44,1,44,3],[52,1,52,4],[52,5,52,8],[115,9,116,9],[115,10,115,11],[89,6,90,6],[89,7,90,7],[106,5,106,6],[115,5,115,8],[106,0,107,0],[106,1,107,1],[106,2,107,2],[106,3,107,3],[106,4,107,4],[89,0,90,0],[89,1,90,1],[89,2,89,3],[89,4,90,4],[89,5,90,5],[282,10,282,12],[283,2,285,2],[283,3,285,3],[283,4,285,4],[283,5,285,5],[283,6,283,7],[283,8,285,8],[283,10,285,10],[283,11,285,11],[283,12,285,12],[284,6,285,6],[284,7,285,7],[125,8,127,8],[125,9,127,9],[290,0,290,1],[280,0,280,1],[282,0,285,0],[282,1,285,1],[282,2,282,3],[282,4,282,8],[282,9,285,9],[128,0,128,1],[129,0,129,1],[124,4,124,6],[125,4,126,5],[125,6,127,6],[124,2,127,2],[126,0,127,0],[126,1,127,1],[124,3,127,3],[10,0,10,2],[124,21,127,21],[125,11,125,14],[125,15,127,15],[125,20,127,20],[126,12,126,14],[125,18,127,18],[124,0,125,1],[125,7,127,7],[126,11,127,11],[125,10,127,10],[125,17,127,17],[124,7,124,15],[124,16,127,16],[124,17,124,20],[125,19,127,19]]}
[]
[]
[]
[]
[]
["MS.60.4.4A"]
["CAP. 2 ACTIVITATEA SPITALULUI, A AMBULATORIULUI INTEGRAT ŞI A CABINETELOR MEDICALE DE SPECIALITATE "]
[]
[]
["1. Consultaţii de tip ambulator"]
["Cabinet la 31 decembrie 1=funcțional sau 0=nefuncțional",null,null,0,0,0,0,0,0,0,0,0,0,0,0,0,0,0,0,0,0,0,0,0,0,0,0,0,0,0,0,0,0,0,0]
["Specificare","Adulţi/copii","TOTAL","Alergologie, imunologie clinică","Boli infecţioase","Cardiologie","Chirurgie","Dermato-venerologie","Diabet  zaharat, nutriţie şi boli de metabolism","Endocrinologie","Gastroente-rologie","Geriatrie şi gerontologie","Hematologie","Medicină generală","Medicină internă","Medicina muncii","Medicină sportivă","Nefrologie","Neurologie","Obstetrică- ginecologie","Oftalmologie","Oncologie medicală","Ortopedie şi traumatologie","O.R.L.","Pediatrie","Planificare familială","Pneumologie","Psihiatrie","Reumatologie","Recup. medicină fizică şi balneolog","Recuperare neuro-psiho-motorie","Urologie","Stomatologie","Centru de sănătate mintală","Alte specialităţi"]
["A","B",1,2,3,4,5,6,7,8,9,10,11,12,13,14,15,16,17,18,19,20,21,22,23,24,25,26,27,28,29,30,31,32,33]
["TOTAL",null,{"$f":"SUM(C15:C18)","v":0},{"$f":"SUM(D15:D18)","v":0},{"$f":"SUM(E15:E18)","v":0},0,0,0,0,0,0,0,0,0,0,0,0,0,0,0,0,0,0,0,0,0,0,0,0,0,0,0,0,0,0]
["pt. locuitorii din urban","adulţi ",{"$f":"SUM(D15:AI15)","v":0},0,0,0,0,0,0,0,0,0,0,0,0,0,0,0,0,0,0,0,0,0,0,0,0,0,0,0,0,0,0,0,0]
[null,"copii",{"$f":"SUM(D16:AI16)","v":0},0,0,0,0,0,0,0,0,0,0,0,0,0,0,0,0,0,0,0,0,0,0,0,0,0,0,0,0,0,0,0,0]
["pt. locuitorii din rural","adulţi ",{"$f":"SUM(D17:AI17)","v":0},0,0,0,0,0,0,0,0,0,0,0,0,0,0,0,0,0,0,0,0,0,0,0,0,0,0,0,0,0,0,0,0]
[null,"copii",{"$f":"SUM(D18:AI18)","v":0},0,0,0,0,0,0,0,0,0,0,0,0,0,0,0,0,0,0,0,0,0,0,0,0,0,0,0,0,0,0,0,0]
["NUMĂR CABINETE",null,{"$f":"SUM(D19:AI19)","v":0},0,0,0,0,0,0,0,0,0,0,0,0,0,0,0,0,0,0,0,0,0,0,0,0,0,0,0,0,0,0,0,0]
["2. Tratamente de tip ambulator",null,null,{"$f":"IF(OR(AND(OR(D14>0),D11=1,D19>0),AND(OR(D14=0),D11=0,D19=0),AND(OR(D14>0),D11=0,D19=0)),\"OK\",\"ERR\")","v":"OK"},{"$f":"IF(OR(AND(OR(E14>0),E11=1,E19>0),AND(OR(E14=0),E11=0,E19=0),AND(OR(E14>0),E11=0,E19=0)),\"OK\",\"ERR\")","v":"OK"},"OK","OK","OK","OK","OK","OK","OK","OK","OK","OK","OK","OK","OK","OK","OK","OK","OK","OK","OK","OK","OK","OK","OK","OK","OK","OK","OK","OK","OK","OK"]
[]
["Specificare",null,"TOTAL","Alergologie, imunologie clinică","Boli infecţioase","Cardiologie","Chirurgie","Dermato-venerologie","Diabet  zaharat, nutriţie şi boli de metabolism","Endocrinologie","Gastroente-rologie","Geriatrie şi gerontologie","Hematologie","Medicină generală","Medicină internă","Medicina muncii","Medicină sportivă","Nefrologie","Neurologie","Obstetrică- ginecologie","Oftalmologie","Oncologie medicală","Ortopedie şi traumatologie","O.R.L.","Pediatrie","Planificare familială","Pneumologie","Psihiatrie","Reumatologie","Recup. medicină fizică şi balneolog","Recuperare neuro-psiho-motorie","Urologie","Stomatologie","Centru de sănătate mintală","Alte specialităţi"]
["A","B",1,2,3,4,5,6,7,8,9,10,11,12,13,14,15,16,17,18,19,20,21,22,23,24,25,26,27,28,29,30,31,32,33]
["TOTAL",null,{"$f":"SUM(C25:C28)","v":0},0,0,0,0,0,0,0,0,0,0,0,0,0,0,0,0,0,0,0,0,0,0,0,0,0,0,0,0,0,0,0,0]
["pt. locuitorii din urban","adulţi ",{"$f":"SUM(D25:AI25)","v":0},0,0,0,0,0,0,0,0,0,0,0,0,0,0,0,0,0,0,0,0,0,0,0,0,0,0,0,0,0,0,0,0]
[null,"copii",{"$f":"SUM(D26:AI26)","v":0},0,0,0,0,0,0,0,0,0,0,0,0,0,0,0,0,0,0,0,0,0,0,0,0,0,0,0,0,0,0,0,0]
["pt. locuitorii din rural","adulţi ",{"$f":"SUM(D27:AI27)","v":0},0,0,0,0,0,0,0,0,0,0,0,0,0,0,0,0,0,0,0,0,0,0,0,0,0,0,0,0,0,0,0,0]
[null,"copii",{"$f":"SUM(D28:AI28)","v":0},0,0,0,0,0,0,0,0,0,0,0,0,0,0,0,0,0,0,0,0,0,0,0,0,0,0,0,0,0,0,0,0]
[]
["3. Activitatea structurilor de urgenţă"]
[]
["Specificare",null,"TOTAL","CONSULTAŢII",null,"TOTAL","TRATAMENTE",null,"TOTAL STOMATOLOGIE","CONSULTAŢII",null,"TOTAL STOMATOLOGIE","TRATAMENTE"]
[null,null,null,"pt. locuitorii din urban","pt. locuitorii din rural",null,"pt. locuitorii din urban","pt. locuitorii din rural",null,"pt. locuitorii din urban","pt. locuitorii din rural",null,"pt. locuitorii din urban","pt. locuitorii din rural"]
["A","B",1,2,3,4,5,6,7,8,9,10,11,12]
["TOTAL",null,{"$f":"SUM(C36:C37)","v":0},0,0,0,0,0,0,0,0,0,0,0]
["din care:","adulţi ",{"$f":"SUM(D36:E36)","v":0},{"$f":"+D38+D40","v":0},{"$f":"+E38+E40","v":0},{"$f":"SUM(G36:H36)","v":0},{"$f":"+G38+G40","v":0},{"$f":"+H38+H40","v":0},{"$f":"SUM(J36:K36)","v":0},{"$f":"+J38+J40","v":0},{"$f":"+K38+K40","v":0},{"$f":"SUM(M36:N36)","v":0},{"$f":"+M38+M40","v":0},{"$f":"+N38+N40","v":0}]
[null,"copii",0,{"$f":"+D39+D41","v":0},{"$f":"+E39+E41","v":0},0,{"$f":"+G39+G41","v":0},{"$f":"+H39+H41","v":0},0,{"$f":"+J39+J41","v":0},{"$f":"+K39+K41","v":0},0,{"$f":"+M39+M41","v":0},{"$f":"+N39+N41","v":0}]
["Camera de garda","adulţi ",0,0,0,0,0,0,0,0,0,0,0,0]
[null,"copii",0,0,0,0,0,0,0,0,0,0,0,0]
["UPU/CPU","adulţi ",0,0,0,0,0,0,0,0,0,0,0,0]
[null,"copii",0,0,0,0,0,0,0,0,0,0,0,0]
["NR.CABINETE STOMATOLOGICE",null,null,null,null,null,null,null,0]
["4. Insuficienţă renală cronică",null,null,null,null,null,null,null,{"$f":"IF(OR(AND(J35=0,K35=0,I42=0),AND(OR(J35>0,K35>0),I42>0)),\"OK\",\"ERR\")","v":"OK"}]
[]
["Nr.bolnavi cu insuficienţă renală cronică","Bolnavi dializaţi",null,null,"Număr total şedinţe de hemodializă","Număr schimburi de dializă peritoneală"]
[null,"TOTAL","din care:"]
[null,null,"Hemodializă","Dializă peritoneală"]
[1,2,3,4,5,6]
[0,0,0,0,0,0]
[]
["5. Insuficienţă renală acută"]
[]
["Număr bolnavi cu insuficienţă renală acută, intoxicaţii, plasmafereză","Trataţi cu:",null,null,null,"Număr total şedinţe de:"]
[null,"Hemodializă","Hemofiltrare continuă","Hemoperfuzie","Plasmafereză","Hemodializă","Hemofiltrare continuă","Hemoperfuzie","Plasmafereză"]
[1,2,3,4,5,6,7,8,9]
[0,0,0,0,0,0,0,0,0]
[]
[]
[]
[]
[]
[]
[]
[]
[]
[]
[]
[]
[]
[]
[]
[]
[]
[]
[]
[]
[]
[]
[]
[]
[]
[]
[]
[]
[]
["8. Alte proceduri"]
[]
["a) Proceduri oncologice                                              ",null,null,null,"b) Teste de diagnostic                  ",null,"c) Proceduri postmortem"]
[]
["Specificare","Rând","Nr.şedinţe",null,"Nr. EKG","Nr. EEG","Total proceduri","Nr. necropsii"]
[null,null,"Chimioterapie","Rontgenterapie"]
["A","B",1,2,3,4,5,6]
["TOTAL",1,{"$f":"+C94+C95","v":0},0,0,0,0,0]
["urban",2,0,0,0,0,0,0]
["rural",3,0,0,0,0,0,0]
[]
["9. Servicii imagistice"]
[]
["Specificare","Rând","Nr. fluoroscopii","Nr.radiografii","Nr.tomografii","Nr. angiografii","Nr.ecografii","Nr.R.M.N.","Nr. investigaţii de medicină nucleară","Alte servicii imagistice"]
["A","B",1,2,3,4,5,6,7,8]
["TOTAL",1,{"$f":"+C102+C103","v":0},0,0,0,0,0,0,0]
["urban",2,0,0,0,0,0,0,0,0]
["rural",3,0,0,0,0,0,0,0,0]
[]
[]
[]
[]
[]
[]
[]
[]
[]
[]
["11. Mişcarea însoţitorilor în spital"]
[]
["Specificare","Rând","PATURI",null,null,"ÎNSOŢITORI",null,null,null,"Om-zile spitalizare (contabile)","INDICI"]
[null,null,"Existente la sfărşitul anului","Media anuală","Zile/paturi scoase temporar din funcţiune","Aflaţi","Intraţi","Ieşiţi","Rămaşi",null,"Utilizarea paturilor","Durata medie de spitalizare"]
["A","B",1,2,3,4,5,6,7,8,9,10]
["Total",1,{"$f":"SUM(C120:C120)","v":0},{"$f":"SUM(D120:D120)","v":0},{"$f":"SUM(E120:E121)","v":0},0,0,0,0,0,{"$f":"IF(D119=0,0,J119/D119)","v":0},{"$f":"IF(F119+G119=0,0,J119/(+F119+G119))","v":0}]
["Însoţitori pentru copii",2,0,0,0,0,0,0,{"$f":"+F120+G120-H120","v":0},0,{"$f":" IF(D120=0,0,  J120/D120)","v":0},{"$f":"IF(F120+G120=0,0,J120/(+F120+G120))","v":0},{"$f":"IF(I120>=(0),\"OK\",\"Err\")","v":"OK"}]
["Însoţitori pentru adulţi",3,0,0,0,0,0,0,{"$f":"+F121+G121-H121","v":0},0,0,{"$f":"IF(F121+G121=0,0,J121/(+F121+G121))","v":0},{"$f":"IF(I121>=(0),\"OK\",\"Err\")","v":"OK"}]
[null,null,null,null," "]
["12. Mişcarea bolnavilor în spital"]
[]
["Denumirea secţiei/compartimentului",null,"Secţie/ compartiment (S/C)","Clinic/Neclinic","Număr paturi",null,null,"Număr bolnavi",null,null,null,null,null,null,null,null,"Om-zile spitalizare","Indici",null,null,null,"Cheltuieli medicamente spital"]
[null,null,null,null,"Existente la sfârşitul anului",null,"Media anuală a paturilor","Aflaţi","Intraţi","Transferaţi din alte secţii","Transferaţi în alte secţii","Ieşiţi",null,null,null,"Rămaşi",null,"Utilizarea paturilor","Durata medie de spitalizare","Mortalitatea în spitale","Rulajul (bolnav/pat)"]
["Secţie/ compartiment","Subsecţie 2/ subcompartiment2",null,null,null,null,null,null,null,null,null,"Total","din care:"]
[null,null,null,null,"Urban","Rural",null,null,null,null,null,null,"asigurați","din rural","decedaţi"]
["A",null,"B","C",1,2,3,4,5,6,7,8,9,10,11,12,13,14,15,16,17,18]
["Total",null,null,null,{"$f":"SUMIF($B131:$B279,\"\",E131:E279)","v":0},{"$f":"SUMIF($B131:$B279,\"\",F131:F279)","v":0},{"$f":"SUMIF($B131:$B279,\"\",G131:G279)","v":0},0,0,0,0,0,0,{"$f":"SUMIF($B131:$B279,\"\",N131:N279)","v":0},{"$f":"SUMIF($B131:$B279,\"\",O131:O279)","v":0},{"$f":"+H130+I130+J130-K130-L130","v":0},{"$f":"SUMIF($B131:$B279,\"\",Q131:Q279)","v":0},{"$f":"IF(G130=0,0,Q130/G130)","v":0},{"$f":"IF(SUM(H130:I130)=0,0,Q130/SUM(H130:I130))","v":0},{"$f":"IF(L130=0,0, O130*100/L130)","v":0},{"$f":"IF(G130=0,0,SUM(H130:I130)/G130)","v":0},{"$f":"SUMIF(B131:B279,\"\",V131:V279)","v":0},{"$f":"IF(OR(L130>=(M130),(AND(L130=0,M130=0))),\"OK\",\"Err\")","v":"OK"},{"$f":"IF(OR(L130>(N130),(AND(L130=0,N130=0))),\"OK\",\"Err\")","v":"OK"},{"$f":"IF(OR(L130>(O130),(AND(L130=0,O130=0))),\"OK\",\"Err\")","v":"OK"},{"$f":"IF(P130>=(0),\"OK\",\"Err\")","v":"OK"}]
[null,null,null,null,0,0,0,0,0,0,0,0,0,0,0,0,0,0,{"$f":"IF(SUM(H131:J131)=0,0,Q131/SUM(H131:J131))","v":0},0,{"$f":"IF(G131=0,0,SUM(H131:J131)/G131)","v":0},0,{"$f":"IF(OR(L131>=(M131),(AND(L131=0,M131=0))),\"OK\",\"Err\")","v":"OK"},"OK","OK","OK"]
[null,null,null,null,0,0,0,0,0,0,0,0,0,0,0,0,0,0,0,0,0,0,"OK","OK","OK","OK"]
[null,null,null,null,0,0,0,0,0,0,0,0,0,0,0,0,0,0,0,0,0,0,"OK","OK","OK","OK"]
[null,null,null,null,0,0,0,0,0,0,0,0,0,0,0,0,0,0,0,0,0,0,"OK","OK","OK","OK"]
[null,null,null,null,0,0,0,0,0,0,0,0,0,0,0,0,0,0,0,0,0,0,"OK","OK","OK","OK"]
[null,null,null,null,0,0,0,0,0,0,0,0,0,0,0,0,0,0,0,0,0,0,"OK","OK","OK","OK"]
[null,null,null,null,0,0,0,0,0,0,0,0,0,0,0,0,0,0,0,0,0,0,"OK","OK","OK","OK"]
[null,null,null,null,0,0,0,0,0,0,0,0,0,0,0,0,0,0,0,0,0,0,"OK","OK","OK","OK"]
[null,null,null,null,0,0,0,0,0,0,0,0,0,0,0,0,0,0,0,0,0,0,"OK","OK","OK","OK"]
[null,null,null,null,0,0,0,0,0,0,0,0,0,0,0,0,0,0,0,0,0,0,"OK","OK","OK","OK"]
[null,null,null,null,0,0,0,0,0,0,0,0,0,0,0,0,0,0,0,0,0,0,"OK","OK","OK","OK"]
[null,null,null,null,0,0,0,0,0,0,0,0,0,0,0,0,0,0,0,0,0,0,"OK","OK","OK","OK"]
[null,null,null,null,0,0,0,0,0,0,0,0,0,0,0,0,0,0,0,0,0,0,"OK","OK","OK","OK"]
[null,null,null,null,0,0,0,0,0,0,0,0,0,0,0,0,0,0,0,0,0,0,"OK","OK","OK","OK"]
[null,null,null,null,0,0,0,0,0,0,0,0,0,0,0,0,0,0,0,0,0,0,"OK","OK","OK","OK"]
[null,null,null,null,0,0,0,0,0,0,0,0,0,0,0,0,0,0,0,0,0,0,"OK","OK","OK","OK"]
[null,null,null,null,0,0,0,0,0,0,0,0,0,0,0,0,0,0,0,0,0,0,"OK","OK","OK","OK"]
[null,null,null,null,0,0,0,0,0,0,0,0,0,0,0,0,0,0,0,0,0,0,"OK","OK","OK","OK"]
[null,null,null,null,0,0,0,0,0,0,0,0,0,0,0,0,0,0,0,0,0,0,"OK","OK","OK","OK"]
[null,null,null,null,0,0,0,0,0,0,0,0,0,0,0,0,0,0,0,0,0,0,"OK","OK","OK","OK"]
[null,null,null,null,0,0,0,0,0,0,0,0,0,0,0,0,0,0,0,0,0,0,"OK","OK","OK","OK"]
[null,null,null,null,0,0,0,0,0,0,0,0,0,0,0,0,0,0,0,0,0,0,"OK","OK","OK","OK"]
[null,null,null,null,0,0,0,0,0,0,0,0,0,0,0,0,0,0,0,0,0,0,"OK","OK","OK","OK"]
[null,null,null,null,0,0,0,0,0,0,0,0,0,0,0,0,0,0,0,0,0,0,"OK","OK","OK","OK"]
[null,null,null,null,0,0,0,0,0,0,0,0,0,0,0,0,0,0,0,0,0,0,"OK","OK","OK","OK"]
[null,null,null,null,0,0,0,0,0,0,0,0,0,0,0,0,0,0,0,0,0,0,"OK","OK","OK","OK"]
[null,null,null,null,0,0,0,0,0,0,0,0,0,0,0,0,0,0,0,0,0,0,"OK","OK","OK","OK"]
[null,null,null,null,0,0,0,0,0,0,0,0,0,0,0,0,0,0,0,0,0,0,"OK","OK","OK","OK"]
[null,null,null,null,0,0,0,0,0,0,0,0,0,0,0,0,0,0,0,0,0,0,"OK","OK","OK","OK"]
[null,null,null,null,0,0,0,0,0,0,0,0,0,0,0,0,0,0,0,0,0,0,"OK","OK","OK","OK"]
[null,null,null,null,0,0,0,0,0,0,0,0,0,0,0,0,0,0,0,0,0,0,"OK","OK","OK","OK"]
[null,null,null,null,0,0,0,0,0,0,0,0,0,0,0,0,0,0,0,0,0,0,"OK","OK","OK","OK"]
[null,null,null,null,0,0,0,0,0,0,0,0,0,0,0,0,0,0,0,0,0,0,"OK","OK","OK","OK"]
[null,null,null,null,0,0,0,0,0,0,0,0,0,0,0,0,0,0,0,0,0,0,"OK","OK","OK","OK"]
[null,null,null,null,0,0,0,0,0,0,0,0,0,0,0,0,0,0,0,0,0,0,"OK","OK","OK","OK"]
[null,null,null,null,0,0,0,0,0,0,0,0,0,0,0,0,0,0,0,0,0,0,"OK","OK","OK","OK"]
[null,null,null,null,0,0,0,0,0,0,0,0,0,0,0,0,0,0,0,0,0,0,"OK","OK","OK","OK"]
[null,null,null,null,0,0,0,0,0,0,0,0,0,0,0,0,0,0,0,0,0,0,"OK","OK","OK","OK"]
[null,null,null,null,0,0,0,0,0,0,0,0,0,0,0,0,0,0,0,0,0,0,"OK","OK","OK","OK"]
[null,null,null,null,0,0,0,0,0,0,0,0,0,0,0,0,0,0,0,0,0,0,"OK","OK","OK","OK"]
[null,null,null,null,0,0,0,0,0,0,0,0,0,0,0,0,0,0,0,0,0,0,"OK","OK","OK","OK"]
[null,null,null,null,0,0,0,0,0,0,0,0,0,0,0,0,0,0,0,0,0,0,"OK","OK","OK","OK"]
[null,null,null,null,0,0,0,0,0,0,0,0,0,0,0,0,0,0,0,0,0,0,"OK","OK","OK","OK"]
[null,null,null,null,0,0,0,0,0,0,0,0,0,0,0,0,0,0,0,0,0,0,"OK","OK","OK","OK"]
[null,null,null,null,0,0,0,0,0,0,0,0,0,0,0,0,0,0,0,0,0,0,"OK","OK","OK","OK"]
[null,null,null,null,0,0,0,0,0,0,0,0,0,0,0,0,0,0,0,0,0,0,"OK","OK","OK","OK"]
[null,null,null,null,0,0,0,0,0,0,0,0,0,0,0,0,0,0,0,0,0,0,"OK","OK","OK","OK"]
[null,null,null,null,0,0,0,0,0,0,0,0,0,0,0,0,0,0,0,0,0,0,"OK","OK","OK","OK"]
[null,null,null,null,0,0,0,0,0,0,0,0,0,0,0,0,0,0,0,0,0,0,"OK","OK","OK","OK"]
[null,null,null,null,0,0,0,0,0,0,0,0,0,0,0,0,0,0,0,0,0,0,"OK","OK","OK","OK"]
[null,null,null,null,0,0,0,0,0,0,0,0,0,0,0,0,0,0,0,0,0,0,"OK","OK","OK","OK"]
[null,null,null,null,0,0,0,0,0,0,0,0,0,0,0,0,0,0,0,0,0,0,"OK","OK","OK","OK"]
[null,null,null,null,0,0,0,0,0,0,0,0,0,0,0,0,0,0,0,0,0,0,"OK","OK","OK","OK"]
[null,null,null,null,0,0,0,0,0,0,0,0,0,0,0,0,0,0,0,0,0,0,"OK","OK","OK","OK"]
[null,null,null,null,0,0,0,0,0,0,0,0,0,0,0,0,0,0,0,0,0,0,"OK","OK","OK","OK"]
[null,null,null,null,0,0,0,0,0,0,0,0,0,0,0,0,0,0,0,0,0,0,"OK","OK","OK","OK"]
[null,null,null,null,0,0,0,0,0,0,0,0,0,0,0,0,0,0,0,0,0,0,"OK","OK","OK","OK"]
[null,null,null,null,0,0,0,0,0,0,0,0,0,0,0,0,0,0,0,0,0,0,"OK","OK","OK","OK"]
[null,null,null,null,0,0,0,0,0,0,0,0,0,0,0,0,0,0,0,0,0,0,"OK","OK","OK","OK"]
[null,null,null,null,0,0,0,0,0,0,0,0,0,0,0,0,0,0,0,0,0,0,"OK","OK","OK","OK"]
[null,null,null,null,0,0,0,0,0,0,0,0,0,0,0,0,0,0,0,0,0,0,"OK","OK","OK","OK"]
[null,null,null,null,0,0,0,0,0,0,0,0,0,0,0,0,0,0,0,0,0,0,"OK","OK","OK","OK"]
[null,null,null,null,0,0,0,0,0,0,0,0,0,0,0,0,0,0,0,0,0,0,"OK","OK","OK","OK"]
[null,null,null,null,0,0,0,0,0,0,0,0,0,0,0,{"$f":"+H194+I194+J194-K194-L194","v":0},0,{"$f":"IF(G194=0,0,Q194/G194)","v":0},0,{"$f":"IF(L194=0,0, O194*100/L194)","v":0},0,0,"OK",{"$f":"IF(OR(L194>(N194),(AND(L194=0,N194=0))),\"OK\",\"Err\")","v":"OK"},{"$f":"IF(OR(L194>(O194),(AND(L194=0,O194=0))),\"OK\",\"Err\")","v":"OK"},{"$f":"IF(P194>=(0),\"OK\",\"Err\")","v":"OK"}]
[null,null,null,null,0,0,0,0,0,0,0,0,0,0,0,0,0,0,{"$f":"IF(SUM(H195:J195)=0,0,Q195/SUM(H195:J195))","v":0},0,{"$f":"IF(G195=0,0,SUM(H195:J195)/G195)","v":0},0,{"$f":"IF(OR(L195>=(M195),(AND(L195=0,M195=0))),\"OK\",\"Err\")","v":"OK"},"OK","OK","OK"]
[null,null,null,null,0,0,0,0,0,0,0,0,0,0,0,0,0,0,0,0,0,0,"OK","OK","OK","OK"]
[null,null,null,null,0,0,0,0,0,0,0,0,0,0,0,0,0,0,0,0,0,0,"OK","OK","OK","OK"]
[null,null,null,null,0,0,0,0,0,0,0,0,0,0,0,0,0,0,0,0,0,0,"OK","OK","OK","OK"]
[null,null,null,null,0,0,0,0,0,0,0,0,0,0,0,0,0,0,0,0,0,0,"OK","OK","OK","OK"]
[null,null,null,null,0,0,0,0,0,0,0,0,0,0,0,0,0,0,0,0,0,0,"OK","OK","OK","OK"]
[null,null,null,null,0,0,0,0,0,0,0,0,0,0,0,0,0,0,0,0,0,0,"OK","OK","OK","OK"]
[null,null,null,null,0,0,0,0,0,0,0,0,0,0,0,0,0,0,0,0,0,0,"OK","OK","OK","OK"]
[null,null,null,null,0,0,0,0,0,0,0,0,0,0,0,0,0,0,0,0,0,0,"OK","OK","OK","OK"]
[null,null,null,null,0,0,0,0,0,0,0,0,0,0,0,0,0,0,0,0,0,0,"OK","OK","OK","OK"]
[null,null,null,null,0,0,0,0,0,0,0,0,0,0,0,0,0,0,0,0,0,0,"OK","OK","OK","OK"]
[null,null,null,null,0,0,0,0,0,0,0,0,0,0,0,0,0,0,0,0,0,0,"OK","OK","OK","OK"]
[null,null,null,null,0,0,0,0,0,0,0,0,0,0,0,0,0,0,0,0,0,0,"OK","OK","OK","OK"]
[null,null,null,null,0,0,0,0,0,0,0,0,0,0,0,0,0,0,0,0,0,0,"OK","OK","OK","OK"]
[null,null,null,null,0,0,0,0,0,0,0,0,0,0,0,0,0,0,0,0,0,0,"OK","OK","OK","OK"]
[null,null,null,null,0,0,0,0,0,0,0,0,0,0,0,0,0,0,0,0,0,0,"OK","OK","OK","OK"]
[null,null,null,null,0,0,0,0,0,0,0,0,0,0,0,0,0,0,0,0,0,0,"OK","OK","OK","OK"]
[null,null,null,null,0,0,0,0,0,0,0,0,0,0,0,0,0,0,0,0,0,0,"OK","OK","OK","OK"]
[null,null,null,null,0,0,0,0,0,0,0,0,0,0,0,0,0,0,0,0,0,0,"OK","OK","OK","OK"]
[null,null,null,null,0,0,0,0,0,0,0,0,0,0,0,0,0,0,0,0,0,0,"OK","OK","OK","OK"]
[null,null,null,null,0,0,0,0,0,0,0,0,0,0,0,0,0,0,0,0,0,0,"OK","OK","OK","OK"]
[null,null,null,null,0,0,0,0,0,0,0,0,0,0,0,0,0,0,0,0,0,0,"OK","OK","OK","OK"]
[null,null,null,null,0,0,0,0,0,0,0,0,0,0,0,0,0,0,0,0,0,0,"OK","OK","OK","OK"]
[null,null,null,null,0,0,0,0,0,0,0,0,0,0,0,0,0,0,0,0,0,0,"OK","OK","OK","OK"]
[null,null,null,null,0,0,0,0,0,0,0,0,0,0,0,0,0,0,0,0,0,0,"OK","OK","OK","OK"]
[null,null,null,null,0,0,0,0,0,0,0,0,0,0,0,0,0,0,0,0,0,0,"OK","OK","OK","OK"]
[null,null,null,null,0,0,0,0,0,0,0,0,0,0,0,0,0,0,0,0,0,0,"OK","OK","OK","OK"]
[null,null,null,null,0,0,0,0,0,0,0,0,0,0,0,0,0,0,0,0,0,0,"OK","OK","OK","OK"]
[null,null,null,null,0,0,0,0,0,0,0,0,0,0,0,0,0,0,0,0,0,0,"OK","OK","OK","OK"]
[null,null,null,null,0,0,0,0,0,0,0,0,0,0,0,0,0,0,0,0,0,0,"OK","OK","OK","OK"]
[null,null,null,null,0,0,0,0,0,0,0,0,0,0,0,0,0,0,0,0,0,0,"OK","OK","OK","OK"]
[null,null,null,null,0,0,0,0,0,0,0,0,0,0,0,0,0,0,0,0,0,0,"OK","OK","OK","OK"]
[null,null,null,null,0,0,0,0,0,0,0,0,0,0,0,0,0,0,0,0,0,0,"OK","OK","OK","OK"]
[null,null,null,null,0,0,0,0,0,0,0,0,0,0,0,0,0,0,0,0,0,0,"OK","OK","OK","OK"]
[null,null,null,null,0,0,0,0,0,0,0,0,0,0,0,0,0,0,0,0,0,0,"OK","OK","OK","OK"]
[null,null,null,null,0,0,0,0,0,0,0,0,0,0,0,0,0,0,0,0,0,0,"OK","OK","OK","OK"]
[null,null,null,null,0,0,0,0,0,0,0,0,0,0,0,0,0,0,0,0,0,0,"OK","OK","OK","OK"]
[null,null,null,null,0,0,0,0,0,0,0,0,0,0,0,0,0,0,0,0,0,0,"OK","OK","OK","OK"]
[null,null,null,null,0,0,0,0,0,0,0,0,0,0,0,0,0,0,0,0,0,0,"OK","OK","OK","OK"]
[null,null,null,null,0,0,0,0,0,0,0,0,0,0,0,0,0,0,0,0,0,0,"OK","OK","OK","OK"]
[null,null,null,null,0,0,0,0,0,0,0,0,0,0,0,0,0,0,0,0,0,0,"OK","OK","OK","OK"]
[null,null,null,null,0,0,0,0,0,0,0,0,0,0,0,0,0,0,0,0,0,0,"OK","OK","OK","OK"]
[null,null,null,null,0,0,0,0,0,0,0,0,0,0,0,0,0,0,0,0,0,0,"OK","OK","OK","OK"]
[null,null,null,null,0,0,0,0,0,0,0,0,0,0,0,0,0,0,0,0,0,0,"OK","OK","OK","OK"]
[null,null,null,null,0,0,0,0,0,0,0,0,0,0,0,0,0,0,0,0,0,0,"OK","OK","OK","OK"]
[null,null,null,null,0,0,0,0,0,0,0,0,0,0,0,0,0,0,0,0,0,0,"OK","OK","OK","OK"]
[null,null,null,null,0,0,0,0,0,0,0,0,0,0,0,0,0,0,0,0,0,0,"OK","OK","OK","OK"]
[null,null,null,null,0,0,0,0,0,0,0,0,0,0,0,0,0,0,0,0,0,0,"OK","OK","OK","OK"]
[null,null,null,null,0,0,0,0,0,0,0,0,0,0,0,0,0,0,0,0,0,0,"OK","OK","OK","OK"]
[null,null,null,null,0,0,0,0,0,0,0,0,0,0,0,0,0,0,0,0,0,0,"OK","OK","OK","OK"]
[null,null,null,null,0,0,0,0,0,0,0,0,0,0,0,0,0,0,0,0,0,0,"OK","OK","OK","OK"]
[null,null,null,null,0,0,0,0,0,0,0,0,0,0,0,0,0,0,0,0,0,0,"OK","OK","OK","OK"]
[null,null,null,null,0,0,0,0,0,0,0,0,0,0,0,0,0,0,0,0,0,0,"OK","OK","OK","OK"]
[null,null,null,null,0,0,0,0,0,0,0,0,0,0,0,0,0,0,0,0,0,0,"OK","OK","OK","OK"]
[null,null,null,null,0,0,0,0,0,0,0,0,0,0,0,0,0,0,0,0,0,0,"OK","OK","OK","OK"]
[null,null,null,null,0,0,0,0,0,0,0,0,0,0,0,0,0,0,0,0,0,0,"OK","OK","OK","OK"]
[null,null,null,null,0,0,0,0,0,0,0,0,0,0,0,0,0,0,0,0,0,0,"OK","OK","OK","OK"]
[null,null,null,null,0,0,0,0,0,0,0,0,0,0,0,0,0,0,0,0,0,0,"OK","OK","OK","OK"]
[null,null,null,null,0,0,0,0,0,0,0,0,0,0,0,0,0,0,0,0,0,0,"OK","OK","OK","OK"]
[null,null,null,null,0,0,0,0,0,0,0,0,0,0,0,0,0,0,0,0,0,0,"OK","OK","OK","OK"]
[null,null,null,null,0,0,0,0,0,0,0,0,0,0,0,0,0,0,0,0,0,0,"OK","OK","OK","OK"]
[null,null,null,null,0,0,0,0,0,0,0,0,0,0,0,0,0,0,0,0,0,0,"OK","OK","OK","OK"]
[null,null,null,null,0,0,0,0,0,0,0,0,0,0,0,0,0,0,0,0,0,0,"OK","OK","OK","OK"]
[null,null,null,null,0,0,0,0,0,0,0,0,0,0,0,{"$f":"+H258+I258+J258-K258-L258","v":0},0,{"$f":"IF(G258=0,0,Q258/G258)","v":0},0,{"$f":"IF(L258=0,0, O258*100/L258)","v":0},0,0,"OK",{"$f":"IF(OR(L258>(N258),(AND(L258=0,N258=0))),\"OK\",\"Err\")","v":"OK"},{"$f":"IF(OR(L258>(O258),(AND(L258=0,O258=0))),\"OK\",\"Err\")","v":"OK"},{"$f":"IF(P258>=(0),\"OK\",\"Err\")","v":"OK"}]
[null,null,null,null,0,0,0,0,0,0,0,0,0,0,0,0,0,0,{"$f":"IF(SUM(H259:J259)=0,0,Q259/SUM(H259:J259))","v":0},0,{"$f":"IF(G259=0,0,SUM(H259:J259)/G259)","v":0},0,{"$f":"IF(OR(L259>=(M259),(AND(L259=0,M259=0))),\"OK\",\"Err\")","v":"OK"},"OK","OK","OK"]
[null,null,null,null,0,0,0,0,0,0,0,0,0,0,0,0,0,0,0,0,0,0,"OK","OK","OK","OK"]
[null,null,null,null,0,0,0,0,0,0,0,0,0,0,0,0,0,0,0,0,0,0,"OK","OK","OK","OK"]
[null,null,null,null,0,0,0,0,0,0,0,0,0,0,0,0,0,0,0,0,0,0,"OK","OK","OK","OK"]
[null,null,null,null,0,0,0,0,0,0,0,0,0,0,0,0,0,0,0,0,0,0,"OK","OK","OK","OK"]
[null,null,null,null,0,0,0,0,0,0,0,0,0,0,0,0,0,0,0,0,0,0,"OK","OK","OK","OK"]
[null,null,null,null,0,0,0,0,0,0,0,0,0,0,0,0,0,0,0,0,0,0,"OK","OK","OK","OK"]
[null,null,null,null,0,0,0,0,0,0,0,0,0,0,0,0,0,0,0,0,0,0,"OK","OK","OK","OK"]
[null,null,null,null,0,0,0,0,0,0,0,0,0,0,0,0,0,0,0,0,0,0,"OK","OK","OK","OK"]
[null,null,null,null,0,0,0,0,0,0,0,0,0,0,0,0,0,0,0,0,0,0,"OK","OK","OK","OK"]
[null,null,null,null,0,0,0,0,0,0,0,0,0,0,0,0,0,0,0,0,0,0,"OK","OK","OK","OK"]
[null,null,null,null,0,0,0,0,0,0,0,0,0,0,0,0,0,0,0,0,0,0,"OK","OK","OK","OK"]
[null,null,null,null,0,0,0,0,0,0,0,0,0,0,0,0,0,0,0,0,0,0,"OK","OK","OK","OK"]
[null,null,null,null,0,0,0,0,0,0,0,0,0,0,0,0,0,0,0,0,0,0,"OK","OK","OK","OK"]
[null,null,null,null,0,0,0,0,0,0,0,0,0,0,0,0,0,0,0,0,0,0,"OK","OK","OK","OK"]
[null,null,null,null,0,0,0,0,0,0,0,0,0,0,0,0,0,0,0,0,0,0,"OK","OK","OK","OK"]
[null,null,null,null,0,0,0,0,0,0,0,0,0,0,0,0,0,0,0,0,0,0,"OK","OK","OK","OK"]
[null,null,null,null,0,0,0,0,0,0,0,0,0,0,0,0,0,0,0,0,0,0,"OK","OK","OK","OK"]
[null,null,null,null,0,0,0,0,0,0,0,0,0,0,0,0,0,0,0,0,0,0,"OK","OK","OK","OK"]
[null,null,null,null,0,0,0,0,0,0,0,0,0,0,0,0,0,0,0,0,0,0,"OK","OK","OK","OK"]
[null,null,null,null,0,0,0,0,0,0,0,0,0,0,0,0,0,0,0,0,0,0,"OK","OK","OK","OK"]
[]
["13. Mişcarea în staţionare din centre de sănătate mintală"]
[]
["Unitatea","Rând","Locuri",null,"Bolnavi",null,null,null,null,"Om-zile apitalizare (contabile)","Indici"]
[null,null,"Existente la sfârşitul anului","Media anuală a locurilor","Aflaţi la începutul anului","Intraţi în cursul anului","Ieşiţi",null,"Rămaşi",null,"Utilizarea paturilor","Durata medie de internare","Mortalitatea în staţionar"]
[null,null,null,null,null,null,"Total","din care: decedaţi"]
[]
["A","B",1,2,3,4,5,6,7,8,9,10,11]
["Locuri în staţionare pentru adulţi",1,0,0,0,0,0,0,{"$f":"+E288+F288-G288","v":0},0,0,0,0,{"$f":"IF(OR(G288>(H288),(AND(G288=0,H288=0))),\"OK\",\"Err\")","v":"OK"}]
["Locuri în staţionare pentru copii",2,0,0,0,0,0,0,{"$f":"+E289+F289-G289","v":0},0,0,0,0,{"$f":"IF(OR(G289>(H289),(AND(G289=0,H289=0))),\"OK\",\"Err\")","v":"OK"}]

{"sheet":"IAAM","index":2,"n_rows":23,"n_cols":19,"rows_kept":23,"cut":false,"hidden":false,"merged":[[2,0,4,0],[2,1,4,1],[2,2,4,2],[2,3,4,3],[2,4,2,5],[2,12,4,12],[2,13,2,16],[3,4,4,4],[3,5,4,5],[3,13,4,13],[3,14,3,16],[2,6,4,6],[2,7,4,7],[2,8,4,8],[2,9,4,9],[2,10,4,10],[2,11,4,11]]}
["14. Infecţii asociate asistenței medicale în unitățile saniatre cu paturi"]
[]
["Secţia/ compartimentul","Rând","Total","Septicemie","Respiratorii",null,"Digestive","Urinare","Organe genitale femei","Cutanate","După: injecţii, puncţii","Plagă chirurgicală","Alte","Decedaţi"]
[null,null,null,null,"Total","Pneumonii, bronho-pneumonii",null,null,null,null,null,null,null,"Total","din care:"]
[null,null,null,null,null,null,null,null,null,null,null,null,null,null,"prin efectele adverse ale agenţilor terapeutici","sub un an","1 - 4 ani"]
["A","B",1,2,3,4,5,6,7,8,9,10,11,12,13,14,15]
["Total",1,{"$f":"SUM(C8:C15)","v":0},0,0,0,0,0,0,0,0,0,0,0,0,0,0]
["Pediatrie",2,{"$f":"+D8+E8+SUM(G8:M8)","v":0},0,0,0,0,0,0,0,0,0,0,0,0,0,0,{"$f":"IF(OR(N8>(O8),(AND(N8=0,O8=0))),\"OK\",\"Err\")","v":"OK"},{"$f":"IF(OR(N8>SUM(P8:Q8),(AND(N8=0,SUM(P8:Q8)=0))),\"OK\",\"Err\")","v":"OK"}]
["Nou născuţi",3,{"$f":"+D9+E9+SUM(G9:M9)","v":0},0,0,0,0,0,0,0,0,0,0,0,0,0,0,"OK","OK"]
["Obstetrică",4,0,0,0,0,0,0,0,0,0,0,0,0,0,0,0,"OK","OK"]
["Ginecologie",5,0,0,0,0,0,0,0,0,0,0,0,0,0,0,0,"OK","OK"]
["Chirurgie",6,0,0,0,0,0,0,0,0,0,0,0,0,0,0,0,"OK","OK"]
["ATI",7,0,0,0,0,0,0,0,0,0,0,0,0,0,0,0,"OK","OK"]
["Dializă",8,0,0,0,0,0,0,0,0,0,0,0,0,0,0,0,"OK","OK"]
["Alte secţii",9,{"$f":"+D15+E15+SUM(G15:M15)","v":0},0,0,0,0,0,0,0,0,0,0,0,0,0,0,"OK","OK"]
[null,null,null,null,null,{"$f":"IF(OR(E8>=(F8),(AND(E8=0,F8=0))),\"OK\",\"Err\")","v":"OK"}]
[null,null,null,null,null,{"$f":"IF(OR(E9>=(F9),(AND(E9=0,F9=0))),\"OK\",\"Err\")","v":"OK"}]
[null,null,null,null,null,"OK"]
[null,null,null,null,null,"OK"]
[null,null,null,null,null,"OK"]
[null,null,null,null,null,"OK"]
[null,null,null,null,null,"OK"]
[null,null,null,null,null,"OK"]

{"sheet":"Transfuzii","index":3,"n_rows":6,"n_cols":8,"rows_kept":6,"cut":false,"hidden":false,"merged":[[2,5,2,6],[2,0,3,0],[2,1,3,1],[2,2,3,2],[2,3,3,3],[2,4,3,4]]}
["10. Transfuzii - se completeaza dupa sediul unitatii sanitare"]
["in spital"]
["Specificare","Rând","Sânge şi plasmă (în litri)","Nr. transfuzii","Nr. bolnavi transfuzaţi","Accidente"]
[null,null,null,null,null,"Total","din care: decese"]
["A","B",1,2,3,4,5]
["TOTAL",1,0,0,0,0,0,{"$f":"IF(OR(F6>(G6),(AND(F6=0,G6=0))),\"OK\",\"Err\")","v":"OK"}]

{"sheet":"c2Sp_Sext_cab_ambulator","index":4,"n_rows":106,"n_cols":35,"rows_kept":106,"cut":false,"hidden":false,"merged":[[13,0,13,1],[14,0,15,0],[16,0,17,0],[18,0,18,1],[21,0,21,1],[23,0,23,1],[31,8,32,8],[31,9,31,10],[31,11,32,11],[31,12,31,13],[31,3,31,4],[31,6,31,7],[31,5,32,5],[34,0,34,1],[24,0,25,0],[26,0,27,0],[31,0,32,1],[31,2,32,2],[44,4,46,4],[35,0,36,0],[37,0,38,0],[39,0,40,0],[44,0,46,0],[44,1,44,3],[10,0,10,2],[89,6,90,6],[89,7,90,7],[59,2,59,3],[59,4,59,5],[89,0,90,0],[89,1,90,1],[89,2,89,3],[89,4,90,4],[89,5,90,5],[44,5,46,5],[45,1,46,1],[45,2,45,3],[52,0,53,0],[52,1,52,4],[52,5,52,8]]}
[]
[]
[]
[]
[]
["MS.60.4.4A"]
["CAP. 2 ACTIVITATEA SPITALULUI, A AMBULATORIULUI INTEGRAT ŞI A CABINETELOR MEDICALE DE SPECIALITATE "]
[]
[]
["1. Consultaţii de tip ambulator"]
["Cabinet la 31 decembrie 1=funcțional sau 0=nefuncțional",null,null,0,0,0,0,0,0,0,0,0,0,0,0,0,0,0,0,0,0,0,0,0,0,0,0,0,0,0,0,0,0,0,0]
["Specificare","Adulţi/copii","TOTAL","Alergologie, imunologie clinică","Boli infecţioase","Cardiologie","Chirurgie","Dermato-venerologie","Diabet  zaharat, nutriţie şi boli de metabolism","Endocrinologie","Gastroente-rologie","Geriatrie şi gerontologie","Hematologie","Medicină generală","Medicină internă","Medicina muncii","Medicină sportivă","Nefrologie","Neurologie","Obstetrică- ginecologie","Oftalmologie","Oncologie medicală","Ortopedie şi traumatologie","O.R.L.","Pediatrie","Planificare familială","Pneumologie","Psihiatrie","Reumatologie","Recup. medicină fizică şi balneolog","Recuperare neuro-psiho-motorie","Urologie","Stomatologie","Centru de sănătate mintală","Alte specialităţi"]
["A","B",1,2,3,4,5,6,7,8,9,10,11,12,13,14,15,16,17,18,19,20,21,22,23,24,25,26,27,28,29,30,31,32,33]
["TOTAL",null,{"$f":"SUM(C15:C18)","v":0},0,0,0,0,0,0,0,0,0,0,0,0,0,0,0,0,0,0,0,0,0,0,0,0,0,0,0,0,0,0,0,0]
["pt. locuitorii din urban","adulţi ",{"$f":"SUM(D15:AI15)","v":0},0,0,0,0,0,0,0,0,0,0,0,0,0,0,0,0,0,0,0,0,0,0,0,0,0,0,0,0,0,0,0,0]
[null,"copii",{"$f":"SUM(D16:AI16)","v":0},0,0,0,0,0,0,0,0,0,0,0,0,0,0,0,0,0,0,0,0,0,0,0,0,0,0,0,0,0,0,0,0]
["pt. locuitorii din rural","adulţi ",{"$f":"SUM(D17:AI17)","v":0},0,0,0,0,0,0,0,0,0,0,0,0,0,0,0,0,0,0,0,0,0,0,0,0,0,0,0,0,0,0,0,0]
[null,"copii",{"$f":"SUM(D18:AI18)","v":0},0,0,0,0,0,0,0,0,0,0,0,0,0,0,0,0,0,0,0,0,0,0,0,0,0,0,0,0,0,0,0,0]
["NUMĂR CABINETE",null,{"$f":"SUM(D19:AI19)","v":0},0,0,0,0,0,0,0,0,0,0,0,0,0,0,0,0,0,0,0,0,0,0,0,0,0,0,0,0,0,0,0,0]
["2. Tratamente de tip ambulator",null,null,{"$f":"IF(OR(AND(OR(D14>0),D11=1,D19>0),AND(OR(D14=0),D11=0,D19=0),AND(OR(D14>0),D11=0,D19=0)),\"OK\",\"ERR\")","v":"OK"},{"$f":"IF(OR(AND(OR(E14>0),E11=1,E19>0),AND(OR(E14=0),E11=0,E19=0),AND(OR(E14>0),E11=0,E19=0)),\"OK\",\"ERR\")","v":"OK"},"OK","OK","OK","OK","OK","OK","OK","OK","OK","OK","OK","OK","OK","OK","OK","OK","OK","OK","OK","OK","OK","OK","OK","OK","OK","OK","OK","OK","OK","OK"]
[]
["Specificare",null,"TOTAL","Alergologie, imunologie clinică","Boli infecţioase","Cardiologie","Chirurgie","Dermato-venerologie","Diabet  zaharat, nutriţie şi boli de metabolism","Endocrinologie","Gastroente-rologie","Geriatrie şi gerontologie","Hematologie","Medicină generală","Medicină internă","Medicina muncii","Medicină sportivă","Nefrologie","Neurologie","Obstetrică- ginecologie","Oftalmologie","Oncologie medicală","Ortopedie şi traumatologie","O.R.L.","Pediatrie","Planificare familială","Pneumologie","Psihiatrie","Reumatologie","Recup. medicină fizică şi balneolog","Recuperare neuro-psiho-motorie","Urologie","Stomatologie","Centru de sănătate mintală","Alte specialităţi"]
["A","B",1,2,3,4,5,6,7,8,9,10,11,12,13,14,15,16,17,18,19,20,21,22,23,24,25,26,27,28,29,30,31,32,33]
["TOTAL",null,{"$f":"SUM(C25:C28)","v":0},0,0,0,0,0,0,0,0,0,0,0,0,0,0,0,0,0,0,0,0,0,0,0,0,0,0,0,0,0,0,0,0]
["pt. locuitorii din urban","adulţi ",{"$f":"SUM(D25:AI25)","v":0},0,0,0,0,0,0,0,0,0,0,0,0,0,0,0,0,0,0,0,0,0,0,0,0,0,0,0,0,0,0,0,0]
[null,"copii",{"$f":"SUM(D26:AI26)","v":0},0,0,0,0,0,0,0,0,0,0,0,0,0,0,0,0,0,0,0,0,0,0,0,0,0,0,0,0,0,0,0,0]
["pt. locuitorii din rural","adulţi ",{"$f":"SUM(D27:AI27)","v":0},0,0,0,0,0,0,0,0,0,0,0,0,0,0,0,0,0,0,0,0,0,0,0,0,0,0,0,0,0,0,0,0]
[null,"copii",{"$f":"SUM(D28:AI28)","v":0},0,0,0,0,0,0,0,0,0,0,0,0,0,0,0,0,0,0,0,0,0,0,0,0,0,0,0,0,0,0,0,0]
[]
[]
[]
[]
[]
[]
[]
[]
[]
[]
[]
[]
[]
[]
["4. Insuficienţă renală cronică"]
[]
["Nr.bolnavi cu insuficienţă renală cronică","Bolnavi dializaţi",null,null,"Număr total şedinţe de hemodializă","Număr schimburi de dializă peritoneală"]
[null,"TOTAL","din care:"]
[null,null,"Hemodializă","Dializă peritoneală"]
[1,2,3,4,5,6]
[0,0,0,0,0,0]
[]
["5. Insuficienţă renală acută"]
[]
["Număr bolnavi cu insuficienţă renală acută, intoxicaţii, plasmafereză","Trataţi cu:",null,null,null,"Număr total şedinţe de:"]
[null,"Hemodializă","Hemofiltrare continuă","Hemoperfuzie","Plasmafereză","Hemodializă","Hemofiltrare continuă","Hemoperfuzie","Plasmafereză"]
[1,2,3,4,5,6,7,8,9]
[0,0,0,0,0,0,0,0,0]
[]
["6. Bolnavi de cancer în evidenţa cabinetului judeţean de oncologie                                           "]
["                                                           "]
["Specificare","Rând","Cazuri noi luate în evidenţă",null,"Bolnavi rămaşi în evidenţă"]
[null,null,"Total","dc: femei","Total","dc: femei"]
["A","B",1,2,3,4]
["Total localizări,     din care:",1,0,0,0,0,{"$f":"IF(OR(C63<(E63),(AND(C63=0,E63=0))),\"OK\",\"Err\")","v":"OK"},"OK",{"$f":"IF(OR(C63>(D63),(AND(C63=0,D63=0))),\"OK\",\"Err\")","v":"OK"},{"$f":"IF(OR(E63>(F63),(AND(E63=0,F63=0))),\"OK\",\"Err\")","v":"OK"}]
["Cancer al colului uterin",2,0,0,0,0,"OK","OK",{"$f":"IF(C64=D64,\"OK\",\"Err\")","v":"OK"},{"$f":"IF(E64=F64,\"OK\",\"Err\")","v":"OK"}]
["Cancer al pielii",3,0,0,0,0,"OK","OK",{"$f":"IF(OR(C65>(D65),(AND(C65=0,D65=0))),\"OK\",\"Err\")","v":"OK"},{"$f":"IF(OR(E65>(F65),(AND(E65=0,F65=0))),\"OK\",\"Err\")","v":"OK"}]
["Cancer al prostatei",4,0,0,0,0,{"$f":"IF(OR(C66<(E66),(AND(C66=0,E66=0))),\"OK\",\"Err\")","v":"OK"}]
["Cancer al sînului la femei",5,0,0,0,0,"OK",{"$f":"IF(OR(D67<(F67),(AND(D67=0,F67=0))),\"OK\",\"Err\")","v":"OK"},{"$f":"IF(C67=D67,\"OK\",\"Err\")","v":"OK"},{"$f":"IF(E67=F67,\"OK\",\"Err\")","v":"OK"}]
["Cancer al stomacului",6,0,0,0,0,"OK","OK",{"$f":"IF(OR(C68>(D68),(AND(C68=0,D68=0))),\"OK\",\"Err\")","v":"OK"},{"$f":"IF(OR(E68>(F68),(AND(E68=0,F68=0))),\"OK\",\"Err\")","v":"OK"}]
["Cancer bronhopulmonar",7,0,0,0,0,"OK","OK","OK","OK"]
["Cancer colorectal",8,0,0,0,0,"OK","OK","OK","OK"]
["Cancer de ficat",9,0,0,0,0,"OK","OK","OK","OK"]
["Cancer de pancreas",10,0,0,0,0,"OK","OK","OK","OK"]
["Cancer vezica urinară",11,0,0,0,0,"OK","OK","OK","OK"]
[null,null,{"$f":"IF(OR(C63>SUM(C64:C73),(AND(C63=0,SUM(C64:C73)=0))),\"OK\",\"Err\")","v":"OK"},{"$f":"IF(OR(D63>SUM(D64:D73),(AND(D63=0,SUM(D64:D73)=0))),\"OK\",\"Err\")","v":"OK"},{"$f":"IF(OR(E63>SUM(E64:E73),(AND(E63=0,SUM(E64:E73)=0))),\"OK\",\"Err\")","v":"OK"},{"$f":"IF(OR(F63>SUM(F64:F73),(AND(F63=0,SUM(F64:F73)=0))),\"OK\",\"Err\")","v":"OK"}]
["7. Depistarea citologică a cancerului colului uterin"]
[]
["Specificare","Rând","În acţiuni de screening","La ginecopate"]
["A","B",1,2]
["Total femei examinate citologic, din care:",1,0,0]
["      suspecte, din care:",2,0,0,{"$f":"IF(OR(C79>(C80),(AND(C79=0,C80=0))),\"OK\",\"Err\")","v":"OK"},{"$f":"IF(OR(D79>(D80),(AND(D79=0,D80=0))),\"OK\",\"Err\")","v":"OK"}]
["            cazuri suspecte confirmate anatomopatologic cu cancer al colului uterin, în stadiul clinic 0",3,0,0,{"$f":"IF(OR(C80>=SUM(C81:C84),(AND(C80=0,SUM(C81:C84)=0))),\"OK\",\"Err\")","v":"OK"},{"$f":"IF(OR(D80>=SUM(D81:D84),(AND(D80=0,SUM(D81:D84)=0))),\"OK\",\"Err\")","v":"OK"}]
["            cazuri suspecte confirmate anatomopatologic cu cancer al colului uterin, în stadiul clinic I",4,0,0]
["            cazuri suspecte confirmate anatomopatologic cu cancer al colului uterin, în stadiul clinic II",5,0,0]
["            cazuri suspecte confirmate anatomopatologic cu cancer al colului uterin, în stadiul clinic III si IV",6,0,0]
[]
["8. Alte proceduri"]
[]
["a) Proceduri oncologice                                              ",null,null,null,"b) Teste de diagnostic                  ",null,"c) Proceduri postmortem"]
[]
["Specificare","Rând","Nr.şedinţe",null,"Nr. EKG","Nr. EEG","Total proceduri","Nr. necropsii"]
[null,null,"Chimioterapie","Rontgenterapie"]
["A","B",1,2,3,4,5,6]
["TOTAL",1,{"$f":"+C94+C95","v":0},0,0,0,0,0]
["urban",2,0,0,0,0,0,0]
["rural",3,0,0,0,0,0,0]
[]
["9. Servicii imagistice"]
[]
["Specificare","Rând","Nr. fluoroscopii","Nr.radiografii","Nr.tomografii","Nr. angiografii","Nr.ecografii","Nr.R.M.N.","Nr. investigaţii de medicină nucleară","Alte servicii imagistice"]
["A","B",1,2,3,4,5,6,7,8]
["TOTAL",1,{"$f":"+C102+C103","v":0},0,0,0,0,0,0,0]
["urban",2,0,0,0,0,0,0,0,0]
["rural",3,0,0,0,0,0,0,0,0]
[]
[]
[null,null,null,null," "]

{"sheet":"c2Amb_spec","index":5,"n_rows":103,"n_cols":36,"rows_kept":103,"cut":false,"hidden":false,"merged":[[89,7,90,7],[106,0,107,0],[106,1,107,1],[106,2,107,2],[89,5,90,5],[89,0,90,0],[89,1,90,1],[89,2,89,3],[89,4,90,4],[89,6,90,6],[80,0,80,1],[81,0,81,1],[82,0,82,1],[83,0,83,1],[79,0,79,1],[78,0,78,1],[44,4,46,4],[44,5,46,5],[45,1,46,1],[45,2,45,3],[52,0,53,0],[52,1,52,4],[52,5,52,8],[44,0,46,0],[44,1,44,3],[59,2,59,3],[59,4,59,5],[76,0,76,1],[77,0,77,1],[39,0,40,0],[31,13,31,14],[26,0,27,0],[31,0,32,0],[31,1,32,1],[31,2,32,2],[31,3,32,3],[31,4,31,5],[31,6,32,6],[31,7,31,8],[31,9,32,9],[31,10,31,11],[31,12,32,12],[34,0,34,1],[35,0,36,0],[37,0,38,0],[10,0,10,3],[24,0,25,0],[13,0,13,1],[14,0,15,0],[16,0,17,0],[18,0,18,1],[23,0,23,1]]}
[]
[]
[]
[]
[]
["MS.60.4.4A"]
["CAP. 2 ACTIVITATEA SPITALULUI, A AMBULATORIULUI INTEGRAT ŞI A CABINETELOR MEDICALE DE SPECIALITATE "]
[null,"(pentru ambulatoriile de specialitate)"]
[]
["1. Consultaţii de tip ambulator"]
["Cabinet la 31 decembrie 1=funcțional sau 0=nefuncțional",null,null,null,0,0,0,0,0,0,0,0,0,0,0,0,0,0,0,0,0,0,0,0,0,0,0,0,0,0,0,0,0,0,0,0]
["Specificare","Adulţi/copii","Rând","TOTAL","Alergologie, imunologie clinică","Boli infecţioase","Cardiologie","Chirurgie","Dermato-venerologie","Diabet  zaharat, nutriţie şi boli de metabolism","Endocrinologie","Gastroente-rologie","Geriatrie şi gerontologie","Hematologie","Medicină generală","Medicină internă","Medicina muncii","Medicină sportivă","Nefrologie","Neurologie","Obstetrică- ginecologie","Oftalmologie","Oncologie medicală","Ortopedie şi traumatologie","O.R.L.","Pediatrie","Planificare familială","Pneumologie","Psihiatrie","Reumatologie","Recup. medicină fizică şi balneolog","Recuperare neuro-psiho-motorie","Urologie","Stomatologie","Centru de sănătate mintală","Alte specialităţi"]
["A","B","C",1,2,3,4,5,6,7,8,9,10,11,12,13,14,15,16,17,18,19,20,21,22,23,24,25,26,27,28,29,30,31,32,33]
["TOTAL",null,1,{"$f":"SUM(D15:D18)","v":0},0,0,0,0,0,0,0,0,0,0,0,0,0,0,0,0,0,0,0,0,0,0,0,0,0,0,0,0,0,0,0,0]
["pt. locuitorii din urban","adulţi ",2,{"$f":"SUM(E15:AJ15)","v":0},0,0,0,0,0,0,0,0,0,0,0,0,0,0,0,0,0,0,0,0,0,0,0,0,0,0,0,0,0,0,0,0]
[null,"copii",3,{"$f":"SUM(E16:AJ16)","v":0},0,0,0,0,0,0,0,0,0,0,0,0,0,0,0,0,0,0,0,0,0,0,0,0,0,0,0,0,0,0,0,0]
["pt. locuitorii din rural","adulţi ",4,{"$f":"SUM(E17:AJ17)","v":0},0,0,0,0,0,0,0,0,0,0,0,0,0,0,0,0,0,0,0,0,0,0,0,0,0,0,0,0,0,0,0,0]
[null,"copii",5,{"$f":"SUM(E18:AJ18)","v":0},0,0,0,0,0,0,0,0,0,0,0,0,0,0,0,0,0,0,0,0,0,0,0,0,0,0,0,0,0,0,0,0]
["NUMĂR CABINETE",null,6,{"$f":"SUM(E19:AJ19)","v":0},0,0,0,0,0,0,0,0,0,0,0,0,0,0,0,0,0,0,0,0,0,0,0,0,0,0,0,0,0,0,0,0]
["2. Tratamente de tip ambulator",null,null,null,{"$f":"IF(OR(AND(OR(E14>0),E11=1,E19>0),AND(OR(E14=0),E11=0,E19=0),AND(OR(E14>0),E11=0,E19=0)),\"OK\",\"ERR\")","v":"OK"},{"$f":"IF(OR(AND(OR(F14>0),F11=1,F19>0),AND(OR(F14=0),F11=0,F19=0),AND(OR(F14>0),F11=0,F19=0)),\"OK\",\"ERR\")","v":"OK"},"OK","OK","OK","OK","OK","OK","OK","OK","OK","OK","OK","OK","OK","OK","OK","OK","OK","OK","OK","OK","OK","OK","OK","OK","OK","OK","OK","OK","OK","OK"]
[]
["Specificare","Adulţi/copii","Rând","TOTAL","Alergologie, imunologie clinică","Boli infecţioase","Cardiologie","Chirurgie","Dermato-venerologie","Diabet  zaharat, nutriţie şi boli de metabolism","Endocrinologie","Gastroente-rologie","Geriatrie şi gerontologie","Hematologie","Medicină generală","Medicină internă","Medicina muncii","Medicină sportivă","Nefrologie","Neurologie","Obstetrică- ginecologie","Oftalmologie","Oncologie medicală","Ortopedie şi traumatologie","O.R.L.","Pediatrie","Planificare familială","Pneumologie","Psihiatrie","Reumatologie","Recup. medicină fizică şi balneolog","Recuperare neuro-psiho-motorie","Urologie","Stomatologie","Centru de sănătate mintală","Alte specialităţi"]
["A","B","C",1,2,3,4,5,6,7,8,9,10,11,12,13,14,15,16,17,18,19,20,21,22,23,24,25,26,27,28,29,30,31,32,33]
["TOTAL",null,1,{"$f":"SUM(D25:D28)","v":0},0,0,0,0,0,0,0,0,0,0,0,0,0,0,0,0,0,0,0,0,0,0,0,0,0,0,0,0,0,0,0,0]
["pt. locuitorii din urban","adulţi ",2,{"$f":"SUM(E25:AJ25)","v":0},0,0,0,0,0,0,0,0,0,0,0,0,0,0,0,0,0,0,0,0,0,0,0,0,0,0,0,0,0,0,0,0]
[null,"copii",3,{"$f":"SUM(E26:AJ26)","v":0},0,0,0,0,0,0,0,0,0,0,0,0,0,0,0,0,0,0,0,0,0,0,0,0,0,0,0,0,0,0,0,0]
["pt. locuitorii din rural","adulţi ",4,{"$f":"SUM(E27:AJ27)","v":0},0,0,0,0,0,0,0,0,0,0,0,0,0,0,0,0,0,0,0,0,0,0,0,0,0,0,0,0,0,0,0,0]
[null,"copii",5,{"$f":"SUM(E28:AJ28)","v":0},0,0,0,0,0,0,0,0,0,0,0,0,0,0,0,0,0,0,0,0,0,0,0,0,0,0,0,0,0,0,0,0]
[]
[]
[]
[]
[]
[]
[]
[]
[]
[]
[]
[]
[]
[]
["4. Insuficienţă renală cronică"]
[]
["Nr.bolnavi cu insuficienţă renală cronică","din care:",null,null,"Număr total şedinţe de hemodializă","Număr schimburi de dializă peritoneală"]
[null,"TOTAL BOLNAVI DIALIZAŢI","din care:"]
[null,null,"Hemodializă","Dializă peritoneală"]
[1,2,3,4,5,6]
[0,0,0,0,0,0]
[]
["5. Insuficienţă renală acută"]
[]
["Număr bolnavi cu insuficienţă renală acută, intoxicaţii, plasmafereză","Trataţi cu:",null,null,null,"Număr total şedinţe de:"]
[null,"Hemodializă","Hemofiltrare continuă","Hemoperfuzie","Plasmafereză","Hemodializă","Hemofiltrare continuă","Hemoperfuzie","Plasmafereză"]
[1,2,3,4,5,6,7,8,9]
[0,0,0,0,0,0,0,0,0]
[]
["6. Bolnavi de cancer în evidenţa cabinetului judeţean de oncologie                                           "]
["                                                           "]
["Specificare","Rând","Cazuri noi luate în evidenţă",null,"Bolnavi rămaşi în evidenţă"]
[null,null,"Total","dc: femei","Total","dc: femei"]
["A","B",1,2,3,4]
["Total localizări,     din care:",1,0,0,0,0,{"$f":"IF(OR(C63<(E63),(AND(C63=0,E63=0))),\"OK\",\"Err\")","v":"OK"},"OK",{"$f":"IF(OR(C63>(D63),(AND(C63=0,D63=0))),\"OK\",\"Err\")","v":"OK"},{"$f":"IF(OR(E63>(F63),(AND(E63=0,F63=0))),\"OK\",\"Err\")","v":"OK"}]
["Cancer al colului uterin",2,0,0,0,0,"OK","OK",{"$f":"IF(C64=D64,\"OK\",\"Err\")","v":"OK"},{"$f":"IF(E64=F64,\"OK\",\"Err\")","v":"OK"}]
["Cancer al pielii",3,0,0,0,0,"OK","OK",{"$f":"IF(OR(C65>(D65),(AND(C65=0,D65=0))),\"OK\",\"Err\")","v":"OK"},{"$f":"IF(OR(E65>(F65),(AND(E65=0,F65=0))),\"OK\",\"Err\")","v":"OK"}]
["Cancer al prostatei",4,0,0,0,0,{"$f":"IF(OR(C66<(E66),(AND(C66=0,E66=0))),\"OK\",\"Err\")","v":"OK"}]
["Cancer al sînului la femei",5,0,0,0,0,"OK",{"$f":"IF(OR(D67<(F67),(AND(D67=0,F67=0))),\"OK\",\"Err\")","v":"OK"},{"$f":"IF(C67=D67,\"OK\",\"Err\")","v":"OK"},{"$f":"IF(E67=F67,\"OK\",\"Err\")","v":"OK"}]
["Cancer al stomacului",6,0,0,0,0,"OK","OK",{"$f":"IF(OR(C68>(D68),(AND(C68=0,D68=0))),\"OK\",\"Err\")","v":"OK"},{"$f":"IF(OR(E68>(F68),(AND(E68=0,F68=0))),\"OK\",\"Err\")","v":"OK"}]
["Cancer bronhopulmonar",7,0,0,0,0,"OK","OK","OK","OK"]
["Cancer colorectal",8,0,0,0,0,"OK","OK","OK","OK"]
["Cancer de ficat",9,0,0,0,0,"OK","OK","OK","OK"]
["Cancer de pancreas",10,0,0,0,0,"OK","OK","OK","OK"]
["Cancer vezica urinară",11,0,0,0,0,"OK","OK","OK","OK"]
[null,null,{"$f":"IF(OR(C63>SUM(C64:C73),(AND(C63=0,SUM(C64:C73)=0))),\"OK\",\"Err\")","v":"OK"},{"$f":"IF(OR(D63>SUM(D64:D73),(AND(D63=0,SUM(D64:D73)=0))),\"OK\",\"Err\")","v":"OK"},{"$f":"IF(OR(E63>SUM(E64:E73),(AND(E63=0,SUM(E64:E73)=0))),\"OK\",\"Err\")","v":"OK"},{"$f":"IF(OR(F63>SUM(F64:F73),(AND(F63=0,SUM(F64:F73)=0))),\"OK\",\"Err\")","v":"OK"}]
["7. Depistarea citologică a cancerului colului uterin"]
[]
["Specificare",null,"Rând","În acţiuni de screening","La ginecopate"]
["A",null,"B",1,2]
["Total femei examinate citologic, din care:",null,1,0,0]
["      suspecte, din care:",null,2,0,0,{"$f":"IF(OR(D79>(D80),(AND(D79=0,D80=0))),\"OK\",\"Err\")","v":"OK"},{"$f":"IF(OR(E79>(E80),(AND(E79=0,E80=0))),\"OK\",\"Err\")","v":"OK"}]
["            cazuri suspecte confirmate anatomopatologic cu cancer al colului uterin, în stadiul clinic 0",null,3,0,0,{"$f":"IF(OR(D80>SUM(D81:D84),(AND(D80=0,SUM(D81:D84)=0))),\"OK\",\"Err\")","v":"OK"},{"$f":"IF(OR(E80>SUM(E81:E84),(AND(E80=0,SUM(E81:E84)=0))),\"OK\",\"Err\")","v":"OK"}]
["            cazuri suspecte confirmate anatomopatologic cu cancer al colului uterin, în stadiul clinic I",null,4,0,0]
["            cazuri suspecte confirmate anatomopatologic cu cancer al colului uterin, în stadiul clinic II",null,5,0,0]
["            cazuri suspecte confirmate anatomopatologic cu cancer al colului uterin, în stadiul clinic III si IV",null,6,0,0]
[]
["8. Alte proceduri"]
[]
["a) Proceduri oncologice                                              ",null,null,null,"b) Teste de diagnostic                  ",null,"c) Proceduri postmortem"]
[]
["Specificare","Rând","Nr.şedinţe",null,"Nr. EKG","Nr. EEG","Total proceduri","Nr. necropsii"]
[null,null,"Chimioterapie","Rontgenterapie"]
["A","B",1,2,1,2,5,6]
["TOTAL",1,{"$f":"+C94+C95","v":0},0,0,0,0,0]
["urban",2,0,0,0,0,0,0]
["rural",3,0,0,0,0,0,0]
[]
["9. Servicii imagistice"]
[]
["Specificare","Rând","Nr. fluoroscopii","Nr.radiografii","Nr.tomografii","Nr. angiografii","Nr.ecografii","Nr.R.M.N.","Nr. investigaţii de medicină nucleară","Alte servicii imagistice"]
["A","B",1,2,3,4,5,6,7,8]
["TOTAL",1,{"$f":"+C102+C103","v":0},0,0,0,0,0,0,0]
["urban",2,0,0,0,0,0,0,0,0]
["rural",3,0,0,0,0,0,0,0,0]

{"sheet":"c3tbcSp_Sext","index":6,"n_rows":214,"n_cols":26,"rows_kept":214,"cut":false,"hidden":false,"merged":[[200,4,200,6],[200,7,201,7],[200,8,200,10],[124,0,124,1],[125,0,125,1],[126,0,126,1],[127,0,127,1],[131,7,131,15],[135,0,135,1],[136,0,136,1],[133,0,134,0],[133,1,134,1],[131,0,132,1],[131,2,134,2],[131,3,134,3],[200,0,201,0],[200,1,201,1],[200,2,200,3],[96,17,96,18],[108,5,108,6],[122,0,123,1],[122,2,123,2],[122,3,123,3],[122,4,122,6],[100,0,101,0],[102,0,103,0],[106,0,106,1],[108,0,109,0],[108,1,109,1],[108,2,109,2],[108,3,109,3],[108,4,109,4],[86,0,86,1],[87,0,87,1],[71,0,73,1],[71,2,73,2],[71,3,73,3],[71,4,71,12],[88,0,88,1],[93,0,97,0],[93,1,97,1],[74,0,74,1],[75,0,76,0],[77,0,78,0],[79,0,80,0],[85,0,85,1],[93,7,97,7],[93,2,97,2],[93,3,97,3],[93,4,97,4],[93,5,97,5],[93,6,97,6],[96,12,97,12],[93,8,97,8],[93,9,97,9],[93,10,97,10],[60,0,62,0],[60,1,62,1],[60,2,62,2],[60,3,62,3],[60,4,60,12],[60,13,61,13],[60,14,61,14],[61,4,62,4],[61,5,62,5],[61,6,62,6],[61,7,62,7],[61,8,62,8],[61,9,62,9],[48,0,51,0],[48,1,48,4],[48,5,48,8],[48,9,48,12],[48,13,48,16],[49,1,49,2],[49,3,49,4],[49,5,49,6],[49,7,49,8],[49,9,49,10],[49,11,49,12],[49,13,49,14],[49,15,49,16],[50,1,51,1],[50,2,51,2],[50,3,51,3],[50,14,51,14],[50,15,51,15],[50,16,51,16],[50,9,51,9],[50,10,51,10],[50,11,51,11],[50,12,51,12],[50,13,51,13],[50,4,51,4],[50,5,51,5],[50,6,51,6],[50,7,51,7],[50,8,51,8],[71,13,73,13],[72,4,73,4],[61,10,62,10],[72,5,73,5],[72,6,73,6],[72,7,73,7],[72,8,73,8],[72,9,73,9],[72,10,73,10],[72,11,72,12],[28,1,30,1],[28,2,29,2],[28,3,28,6],[28,7,28,11],[29,3,31,3],[29,4,29,6],[29,7,30,7],[29,8,31,8],[29,9,31,9],[29,10,31,10],[29,11,31,11],[30,2,31,2],[30,4,31,4],[30,5,30,6],[12,0,17,0],[12,1,12,12],[12,13,12,23],[13,1,16,1],[13,2,13,12],[13,13,13,23],[14,2,16,2],[14,3,15,3],[14,4,14,7],[14,8,14,12],[14,13,16,13],[14,14,15,14],[15,20,17,20],[15,21,17,21],[15,8,16,8],[15,9,17,9],[15,10,17,10],[15,11,17,11],[15,12,17,12],[15,19,16,19],[16,3,17,3],[27,0,31,0],[27,1,27,11],[15,4,17,4],[15,5,15,7],[132,4,133,5],[15,22,17,22],[15,23,17,23],[132,19,134,19],[132,17,134,17],[132,18,134,18],[132,6,134,6],[132,7,134,7],[132,8,134,8],[132,9,134,9],[132,10,134,10],[131,4,131,6],[133,11,134,11],[16,5,17,5],[16,6,16,7],[16,14,17,14],[16,16,17,16],[16,17,16,18],[15,15,17,15],[15,16,15,18],[131,16,134,16],[131,17,131,20],[131,21,134,21],[132,11,132,14],[132,15,134,15],[132,20,134,20],[133,12,133,14],[14,15,14,18],[14,19,14,23],[61,11,61,12],[93,11,97,11],[93,12,93,21],[94,12,94,18],[94,19,94,21],[95,12,95,13],[95,14,95,15],[95,16,95,18],[95,19,97,19],[95,20,97,20],[95,21,97,21],[96,13,97,13],[96,14,97,14],[96,15,97,15],[96,16,97,16]]}
[]
[]
[]
[]
[]
["MS.60.4.4A"]
["Cap. 3 ACTIVITATEA SPITALULUI, SECŢIEI (COMPARTIMENTULUI), CABINETULUI/ DISPENSARULUI DE PNEUMOLOGIE"]
[]
[]
["1. Evidenţa bolnavilor tuberculoşi înregistraţi în cursul anului"]
["1a. Incidenţa (bolnavi noi şi recidive)"]
[]
["Domiciliul bolnavului","Bolnavi înregistraţi în cursul anului:",null,null,null,null,null,null,null,null,null,null,null,"Bolnavi înregistraţi în cursul anului:"]
[null,"Total bolnavi înregistraţi ","Bolnavi noi",null,null,null,null,null,null,null,null,null,null,"Bolnavi recidive (readmişi)"]
[null,null,"Total bolnavi noi","din care:","Tbc aparat respirator",null,null,null,"Tbc extrarespirator",null,null,null,null,"Total recidive","din care:","Tbc aparat respirator",null,null,null,"Tbc extrarespirator"]
[null,null,null,null,"Total aparat respirator","din care: tbc pulmonar",null,null,"Total tbc extraresp.","osteoarticular","ganglionar","urogenital","alte localizări",null,null,"Total aparat respirator","din care: tbc pulmonar",null,null,"Total tbc extraresp.","osteo-articular","ganglionar","urogenital","alte localizări"]
[null,null,null,"Copii 0-14 ani",null,"Total tbc pulmonar","din care: cu bK+",null,null,null,null,null,null,null,"Copii                0-14 ani",null,"Total tbc pulmonar","din care: cu bK+"]
[null,"(col. 01= 02+13)","(col. 02= 04+08)",null,null,null,"Total cu bK+","din care: numai la culturi","(col.08= 09+...+12)",null,null,null,null,"(col.13= 15+19)",null,null,null,"Total cu bK+","din care: numai la culturi","(col.19= 20+...+23)"]
["A",1,2,3,4,5,6,7,8,9,10,11,12,"13","14","15","16","17","18","19","20","21","22","23"]
["Total",{"$f":"SUM(B21:B22)","v":0},{"$f":"SUM(C21:C22)","v":0},0,{"$f":"SUM(E21:E22)","v":0},0,0,0,{"$f":"SUM(J20:M20)","v":0},0,0,0,0,{"$f":"+P20+T20","v":0},0,0,0,0,0,0,0,0,0,0]
["Urban",{"$f":"+C21+N21","v":0},{"$f":"+E21+I21","v":0},0,0,0,0,0,{"$f":"SUM(J21:M21)","v":0},0,0,0,0,{"$f":"+P21+T21","v":0},0,0,0,0,0,{"$f":"SUM(U21:X21)","v":0},0,0,0,0]
["Rural",{"$f":"+C22+N22","v":0},{"$f":"+E22+I22","v":0},0,0,0,0,0,{"$f":"SUM(J22:M22)","v":0},0,0,0,0,{"$f":"+P22+T22","v":0},0,0,0,0,0,{"$f":"SUM(U22:X22)","v":0},0,0,0,0]
[null,null,null,{"$f":"IF(OR(C21>(D21),(AND(C21=0,D21=0))),\"OK \",\"Err\")","v":"OK "},null,{"$f":"IF(E21>=(F21),\"OK \",\"Err\")","v":"OK "},{"$f":"IF(F21>=(G21),\"OK \",\"Err\")","v":"OK "},{"$f":"IF(OR(G21>=(H21),(AND(G21=0,H21=0))),\"OK\",\"Err\")","v":"OK"},null,null,null,null,null,null,{"$f":"IF(OR(N21>=(O21),(AND(N21=0,O21=0))),\"OK\",\"Err\")","v":"OK"},null,{"$f":"IF(P21>=(Q21),\"OK \",\"Err\")","v":"OK "},{"$f":"IF(OR(Q21>=(R21),(AND(Q21=0,R21=0))),\"OK\",\"Err\")","v":"OK"},{"$f":"IF(OR(R21>=(S21),(AND(R21=0,S21=0))),\"OK\",\"Err\")","v":"OK"}]
[null,null,null,{"$f":"IF(OR(C22>(D22),(AND(C22=0,D22=0))),\"OK \",\"Err\")","v":"OK "},null,{"$f":"IF(E22>=(F22),\"OK \",\"Err\")","v":"OK "},{"$f":"IF(F22>=(G22),\"OK \",\"Err\")","v":"OK "},{"$f":"IF(OR(G22>=(H22),(AND(G22=0,H22=0))),\"OK\",\"Err\")","v":"OK"},null,null,null,null,null,null,{"$f":"IF(OR(N22>=(O22),(AND(N22=0,O22=0))),\"OK\",\"Err\")","v":"OK"},null,{"$f":"IF(P22>=(Q22),\"OK \",\"Err\")","v":"OK "},{"$f":"IF(OR(Q22>=(R22),(AND(Q22=0,R22=0))),\"OK\",\"Err\")","v":"OK"},{"$f":"IF(OR(R22>=(S22),(AND(R22=0,S22=0))),\"OK\",\"Err\")","v":"OK"}]
[]
["1b. Prevalenţa (bolnavi rămaşi în evidenţă la 31 decembrie)"]
[]
["Domiciliul bolnavului","Bolnavi rămaşi în evidenţă"]
[null,"Total rămaşi în evidenţă","din care:","Tbc aparat respirator",null,null,null,"Tbc extrarespirator"]
[null,null,null,"Total aparat respirator","din care: tbc pulmonar",null,null,"Total tbc extraresp.","osteoarticular","ganglionar","urogenital","alte localizări"]
[null,null,"Copii 0-14 ani",null,"Total tbc pulmonar","din care: cu bK+"]
[null,"(col. 01= 03+07)",null,null,null,"Total cu bK+","din care: numai la culturi","(col. 07= 08+ ... +11)"]
["A","01","02","03","04","05","06","07","08","09","10","11"]
["Total",{"$f":"SUM(B35:B36)","v":0},0,0,0,0,0,{"$f":"SUM(I34:L34)","v":0},{"$f":"SUM(I35:I36)","v":0},{"$f":"SUM(J35:J36)","v":0},{"$f":"SUM(K35:K36)","v":0},{"$f":"SUM(L35:L36)","v":0}]
["Urban",{"$f":"+D35+H35","v":0},0,0,0,0,0,{"$f":"SUM(I35:L35)","v":0},0,0,0,0]
["Rural",{"$f":"+D36+H36","v":0},0,0,0,0,0,{"$f":"SUM(I36:L36)","v":0},0,0,0,0]
[null,null,{"$f":"IF(OR(B35>(C35),(AND(B35=0,C35=0))),\"OK\",\"Err\")","v":"OK"},null,{"$f":"IF(D35>=(E35),\"OK \",\"Err\")","v":"OK "},{"$f":"IF(E35>=(F35),\"OK \",\"Err\")","v":"OK "},{"$f":"IF(OR(F35>=(G35),(AND(F35=0,G35=0))),\"OK\",\"Err\")","v":"OK"}]
[null,null,{"$f":"IF(OR(B36>(C36),(AND(B36=0,C36=0))),\"OK\",\"Err\")","v":"OK"},null,{"$f":"IF(D36>=(E36),\"OK \",\"Err\")","v":"OK "},{"$f":"IF(E36>=(F36),\"OK \",\"Err\")","v":"OK "},{"$f":"IF(OR(F36>=(G36),(AND(F36=0,G36=0))),\"OK\",\"Err\")","v":"OK"}]
[]
[]
["2. Mişcarea anuală a baciliferilor la bolnavii cu TBC pulmonar"]
[]
["Nr. bolnavi cu bK+ la sfârşitul anului","Nr. bolnavi deveniţi pozitivi în cursul anului (inclusiv transferaţi)","Nr. bolnavi negativaţi în cursul anului ","Nr. bolnavi plecaţi sau decedaţi în cursul anului","Nr. bolnavi cu bK +     la sfârşitul anului"]
[1,2,3,4,5]
[0,0,0,0,{"$f":"+A45+B45-C45-D45","v":0}]
[]
["3. Consultaţii şi tratamente"]
[null,0,"Cabinet la 31 decembrie 1=funcțional sau 0=nefuncțional"]
["Tipul unităţii","Consultaţii",null,null,null,"Tratamente",null,null,null,"Consultaţii stomatologie",null,null,null,"Tratamente stomatologie"]
[null,"Urban",null,"Rural",null,"Urban",null,"Rural",null,"Urban",null,"Rural",null,"Urban",null,"Rural"]
[null,"Total","din care: copii \n0 - 14 ani","Total","din care: copii \n0 - 14 ani","Total","din care: copii \n0 - 14 ani","Total","din care: copii 0 - 14 ani","Total","din care: copii \n0 - 14 ani","Total","din care: copii \n0 - 14 ani","Total","din care: copii \n0 - 14 ani","Total","din care: copii 0 - 14 ani"]
[]
["A",1,2,3,4,5,6,7,8,9,10,11,12,13,14,15,16]
["Dispensar tbc",0,0,0,0,0,0,0,0,0,0,0,0,0,0,0,0]
["Ambulator",0,0,0,0,0,0,0,0,0,0,0,0,0,0,0,0,{"$f":"IF(   AND(B55=0,C55=0), \"           \",IF(B55>C55,\"             \",\"ERR\")         )","v":"           "},{"$f":"IF(   AND(D55=0,E55=0), \"           \",IF(D55>E55,\"             \",\"ERR\")         )","v":"           "},{"$f":"IF(   AND(F55=0,G55=0), \"           \",IF(F55>G55,\"             \",\"ERR\")         )","v":"           "},{"$f":"IF(   AND(H55=0,I55=0), \"           \",IF(H55>I55,\"             \",\"ERR\")         )","v":"           "},{"$f":"IF(   AND(J55=0,K55=0), \"           \",IF(J55>K55,\"             \",\"ERR\")         )","v":"           "},{"$f":"IF(   AND(L55=0,M55=0), \"           \",IF(L55>M55,\"             \",\"ERR\")         )","v":"           "},{"$f":"IF(   AND(N55=0,O55=0), \"           \",IF(N55>O55,\"             \",\"ERR\")         )","v":"           "},{"$f":"IF(   AND(P55=0,Q55=0), \"           \",IF(P55>Q55,\"             \",\"ERR\")         )","v":"           "}]
["Spital",0,0,0,0,0,0,0,0,0,0,0,0,0,0,0,0,{"$f":"IF(   AND(B56=0,C56=0), \"           \",IF(B56>C56,\"             \",\"ERR\")         )","v":"           "},{"$f":"IF(   AND(D56=0,E56=0), \"           \",IF(D56>E56,\"             \",\"ERR\")         )","v":"           "},{"$f":"IF(   AND(F56=0,G56=0), \"           \",IF(F56>G56,\"             \",\"ERR\")         )","v":"           "},{"$f":"IF(   AND(H56=0,I56=0), \"           \",IF(H56>I56,\"             \",\"ERR\")         )","v":"           "},{"$f":"IF(   AND(J56=0,K56=0), \"           \",IF(J56>K56,\"             \",\"ERR\")         )","v":"           "},{"$f":"IF(   AND(L56=0,M56=0), \"           \",IF(L56>M56,\"             \",\"ERR\")         )","v":"           "},{"$f":"IF(   AND(N56=0,O56=0), \"           \",IF(N56>O56,\"             \",\"ERR\")         )","v":"           "},{"$f":"IF(   AND(P56=0,Q56=0), \"           \",IF(P56>Q56,\"             \",\"ERR\")         )","v":"           "}]
["Cameră de gardă",0,0,0,0,0,0,0,0,0,0,0,0,0,0,0,0,{"$f":"IF(   AND(B57=0,C57=0), \"           \",IF(B57>C57,\"             \",\"ERR\")         )","v":"           "},"           ","           ","           ","           ","           ","           ","           "]
["NR.CAB.ÎN AMBULATOR",0,null,null,null,null,null,null,null,0]
["4. Cazuri cu retratament de tuberculoză pulmonară în anul 2021",{"$f":"IF(OR(AND(OR(B55>0,D55>0),B48=1,B58>0),AND(OR(B55=0,D55=0),B48=0,B58=0),AND(OR(B55>0,D55>0),B48=0,B58=0)),\"OK\",\"ERR\")","v":"OK"},null,null,null,null,null,null,null,{"$f":"IF(OR(AND(J55=0,L55=0,J58=0),AND(OR(J55>0,L55>0),J58>0)),\"OK\",\"ERR\")","v":"OK"}]
[]
["Specificare","Aflaţi la începutul anului","Intraţi în cursul anului","Total bolnavi cronici cu retratament (col 1+2)","din care: Evaluaţi",null,null,null,null,null,null,null,null,"Neevaluaţi","Rămaşi la 31 dec"]
[null,null,null,null,"Total evaluaţi (col 5+...+12)","Vindecat sau cu tratament încheiat","Infirmaţi","Abandon, pierdut","Eşec","Mutaţi","Continuă tratament","Decese"]
[null,null,null,null,null,null,null,null,null,null,null,"Tbc","Alte boli","(col. 3-4)","(col. 3-5-6-9-11-12)"]
["A",1,2,3,4,5,6,7,8,9,10,11,12,13,14]
["Cronici",0,0,{"$f":"+B65+C65","v":0},{"$f":"SUM(F65:M65)","v":0},0,0,0,0,0,0,0,0,{"$f":"+D65-E65","v":0},{"$f":"+D65-F65-G65-J65-L65-M65","v":0}]
["Reluaţi după abandon",0,0,{"$f":"+B66+C66","v":0},{"$f":"SUM(F66:M66)","v":0},0,0,0,0,0,0,0,0,{"$f":"+D66-E66","v":0},{"$f":"+D66-F66-G66-J66-L66-M66","v":0}]
["Reluaţi după eşec",0,0,{"$f":"+B67+C67","v":0},{"$f":"SUM(F67:M67)","v":0},0,0,0,0,0,0,0,0,{"$f":"+D67-E67","v":0},{"$f":"+D67-F67-G67-J67-L67-M67","v":0}]
["Recidive",0,0,{"$f":"+B68+C68","v":0},{"$f":"SUM(F68:M68)","v":0},0,0,0,0,0,0,0,0,{"$f":"+D68-E68","v":0},{"$f":"+D68-F68-G68-J68-L68-M68","v":0}]
[]
["5. Evoluţia sub tratament a tuberculozei pentru cohorta anului 2016"]
[]
[null,null,"Total în evidenţă","Total evaluaţi","Evaluaţi",null,null,null,null,null,null,null,null,"Neevaluaţi"]
[null,null,null,null,"Vindecaţi","Tratament încheiat","Infirmaţi","Abandon, pierdut","Eşec","Mutaţi","Continuă tratament","Decese"]
[null,null,null,null,null,null,null,null,null,null,null,"Tbc","Alte"]
["Specificare",null,1,2,3,4,5,6,7,8,9,10,11,12]
["Tbc. pulmonar  pozitivi la examenul microscopic","N",0,{"$f":"SUM(E76:M76)","v":0},0,0,0,0,0,0,0,0,0,{"$f":"+C76-D76","v":0}]
[null,"R",0,0,0,0,0,0,0,0,0,0,0,0]
["Tbc. pulmonar  pozitivi numai la cultură","N",0,0,0,0,0,0,0,0,0,0,0,0]
[null,"R",0,0,0,0,0,0,0,0,0,0,0,0]
["Alte TB           (pulmonare negative)","N",0,0,0,0,0,0,0,0,0,0,0,0]
[null,"R",0,0,0,0,0,0,0,0,0,0,0,0]
["N = caz nou; R = recidive"]
[]
["6. Acţiuni profilactice (depistare radiologică)"]
[]
["Depistări",null,"Rând","Număr persoane examinate","Număr persoane suspecte de modificări pulmonare","Număr persoane confirmate cu TBC"]
["A",null,"B",1,2,3]
["Grupe vulnerabile",null,1,0,0,0,{"$f":"IF(D88>=(E88),\"OK\",\"Err\")","v":"OK"},{"$f":"IF(E88>=(F88),\"OK\",\"Err\")","v":"OK"}]
["Anchete epidemiologice",null,2,0,0,0,{"$f":"IF(D89>=(E89),\"OK\",\"Err\")","v":"OK"},{"$f":"IF(E89>=(F89),\"OK\",\"Err\")","v":"OK"}]
["Notă: Nu vor fi cuprinşi bolnavii trimişi de: dispensare, policlinici, spitale, ca suspecţi de tbc. pt. precizare de diagnostic."]
[]
["7. Numărul  investigaţiilor"]
[]
["Unitate","Rând","Nr. radioscopii","Nr. radiografii","Nr. tomografii","Nr. tomografii computerizate","Analize hematologice","Analize serologice","Analize chimice","Analize anatomo-patologice","Analize citologice","Total  bacteriologie","Bacteriologie"]
[null,null,null,null,null,null,null,null,null,null,null,null,"Bacteriologie bK",null,null,null,null,null,null,"Bacteriologie floră banală"]
[null,null,null,null,null,null,null,null,null,null,null,null,"Microscopii",null,"Culturi",null,"Antibiograme",null,null,"Frotiuri","Culturi","ABG"]
[null,null,null,null,null,null,null,null,null,null,null,null,"Total efectuate","din care: bK+","Total efectuate","din care: bK+","Total efectuate","din care: cu rezistenţă"]
[null,null,null,null,null,null,null,null,null,null,null,null,null,null,null,null,null,"MDR","Alte rezistenţe"]
["A","B",1,2,3,4,5,6,7,8,9,"10","11","12","13","14","15","16","17","18","19","20"]
["Total",1,{"$f":"SUM(C101:C104)","v":0},{"$f":"SUM(D101:D104)","v":0},0,0,0,0,0,0,0,0,0,0,0,0,0,0,0,0,0,0]
["În disp.TBC şi în ambulator de specialit.",2,0,0,0,0,0,0,0,0,0,{"$f":"+M101+O101+Q101+T101+U101+V101","v":0},0,0,0,0,0,0,0,0,0,0]
[null,3,0,0,0,0,0,0,0,0,0,{"$f":"+M102+O102+Q102+T102+U102+V102","v":0},0,0,0,0,0,0,0,0,0,0]
["În spital",4,0,0,0,0,0,0,0,0,0,{"$f":"+M103+O103+Q103+T103+U103+V103","v":0},0,0,0,0,0,0,0,0,0,0]
[null,5,0,0,0,0,0,0,0,0,0,{"$f":"+M104+O104+Q104+T104+U104+V104","v":0},0,0,0,0,0,0,0,0,0,0]
["U = urban;   R = rural",null,null,null,null,null,null,null,null,null,null,null,null,{"$f":"IF(OR(M101>(N101),(AND(M101=0,N101=0))),\"OK\",\"Err\")","v":"OK"},null,{"$f":"IF(OR(O101>(P101),(AND(O101=0,P101=0))),\"OK\",\"Err\")","v":"OK"},null,{"$f":"IF(OR(Q101>(R101),(AND(Q101=0,R101=0))),\"OK\",\"Err\")","v":"OK"}]
[null,null,null,null,null,null,null,null,null,null,null,null,null,{"$f":"IF(OR(M102>(N102),(AND(M102=0,N102=0))),\"OK\",\"Err\")","v":"OK"},null,{"$f":"IF(OR(O102>(P102),(AND(O102=0,P102=0))),\"OK\",\"Err\")","v":"OK"},null,{"$f":"IF(OR(Q102>(R102),(AND(Q102=0,R102=0))),\"OK\",\"Err\")","v":"OK"}]
[null,null,null,null,null,null,null,null,null,null,null,null,null,{"$f":"IF(OR(M103>(N103),(AND(M103=0,N103=0))),\"OK\",\"Err\")","v":"OK"},null,{"$f":"IF(OR(O103>(P103),(AND(O103=0,P103=0))),\"OK\",\"Err\")","v":"OK"},null,{"$f":"IF(OR(Q103>(R103),(AND(Q103=0,R103=0))),\"OK\",\"Err\")","v":"OK"}]
[null,null,null,null,null,null,null,null,null,null,null,null,null,{"$f":"IF(OR(M104>(N104),(AND(M104=0,N104=0))),\"OK\",\"Err\")","v":"OK"},null,{"$f":"IF(OR(O104>(P104),(AND(O104=0,P104=0))),\"OK\",\"Err\")","v":"OK"},null,{"$f":"IF(OR(Q104>(R104),(AND(Q104=0,R104=0))),\"OK\",\"Err\")","v":"OK"}]
[]
[]
[]
[]
[]
[]
[]
["9. Educaţie pt. sănătate"]
[]
["Acţiuni de educaţie pentru sănătate efectuate (lecţii conferinţe, consiliere în focar TB)"]
[0]
[]
["10. Examen bacteriologic la bolnavii internaţi"]
[]
["Baciloscopia la internare",null,"Rând","Total","Baciloscopia la ieşirea din unitate                      (col 1= col. 2 + 3 + 4)"]
[null,null,null,null,"Pozitivă","Negativă","Necontrolată"]
["A",null,"B",1,2,3,4]
["Bolnavi cu baciloscopia pozitivă stabilită la internare",null,1,{"$f":"SUM(E126:G126)","v":0},0,0,0]
["Bolnavi cu baciloscopia negativă stabilită la internare",null,2,{"$f":"SUM(E127:G127)","v":0},0,0,0]
["Bolnavi cu baciloscopia necontrolată la internare",null,3,{"$f":"SUM(E128:G128)","v":0},0,0,0]
[]
["11. Mişcarea bolnavilor în spital (detaliat pe secţiile şi compartimentele de tuberculoză)"]
[]
["Denumirea secţiei/compartimentului",null,"Secţie/ compartiment (S/C)","Clinic/Neclinic","Număr paturi",null,null,"Număr bolnavi",null,null,null,null,null,null,null,null,"Om-zile spitalizare","Indici",null,null,null,"Cheltuieli medicamente spital"]
[null,null,null,null,"Existente la sfârşitul anului",null,"Media anuală a paturilor","Aflaţi","Intraţi","Transferaţi din alte secţii","Transferaţi în alte secţii","Ieşiţi",null,null,null,"Rămaşi",null,"Utilizarea paturilor","Durata medie de spitalizare","Mortalitatea în spitale","Rulajul (bolnav/pat)"]
["Secţie/ compartiment","Subsecţie 2/ subcompartiment2",null,null,null,null,null,null,null,null,null,"Total","din care:"]
[null,null,null,null,"Urban","Rural",null,null,null,null,null,null,"asigurați","din rural","decedaţi"]
["A",null,"B","C",1,2,3,4,5,6,7,8,9,10,11,12,13,14,15,16,17,18]
["Total",null,null,null,{"$f":"SUMIF($B138:$B288,\"\",E138:E288)","v":0},0,0,0,0,0,0,0,0,0,0,{"$f":"+H137+I137+J137-K137-L137","v":0},{"$f":"SUMIF($B138:$B288,\"\",Q138:Q288)","v":0},{"$f":"IF(G137=0,0,Q137/G137)","v":0},{"$f":"IF(SUM(H137:I137)=0,0,Q137/SUM(H137:I137))","v":0},{"$f":"IF(L137=0,0, O137*100/L137)","v":0},{"$f":"IF(G137=0,0,SUM(H137:I137)/G137)","v":0},{"$f":"SUMIF(B138:B288,\"\",V138:V288)","v":0},{"$f":"IF(OR(L137>=(M137),(AND(L137=0,M137=0))),\"OK\",\"Err\")","v":"OK"},{"$f":"IF(OR(L137>(N137),(AND(L137=0,N137=0))),\"OK\",\"Err\")","v":"OK"},{"$f":"IF(OR(L137>(O137),(AND(L137=0,O137=0))),\"OK\",\"Err\")","v":"OK"},{"$f":"IF(P137>=(0),\"OK\",\"Err\")","v":"OK"}]
[null,null,null,null,0,0,0,0,0,0,0,0,0,0,0,0,0,0,{"$f":"IF(SUM(H138:J138)=0,0,Q138/SUM(H138:J138))","v":0},0,{"$f":"IF(G138=0,0,SUM(H138:J138)/G138)","v":0},0,{"$f":"IF(OR(L138>=(M138),(AND(L138=0,M138=0))),\"OK\",\"Err\")","v":"OK"},"OK","OK","OK"]
[null,null,null,null,0,0,0,0,0,0,0,0,0,0,0,0,0,0,0,0,0,0,"OK","OK","OK","OK"]
[null,null,null,null,0,0,0,0,0,0,0,0,0,0,0,0,0,0,0,0,0,0,"OK","OK","OK","OK"]
[null,null,null,null,0,0,0,0,0,0,0,0,0,0,0,0,0,0,0,0,0,0,"OK","OK","OK","OK"]
[null,null,null,null,0,0,0,0,0,0,0,0,0,0,0,0,0,0,0,0,0,0,"OK","OK","OK","OK"]
[null,null,null,null,0,0,0,0,0,0,0,0,0,0,0,0,0,0,0,0,0,0,"OK","OK","OK","OK"]
[null,null,null,null,0,0,0,0,0,0,0,0,0,0,0,0,0,0,0,0,0,0,"OK","OK","OK","OK"]
[null,null,null,null,0,0,0,0,0,0,0,0,0,0,0,0,0,0,0,0,0,0,"OK","OK","OK","OK"]
[null,null,null,null,0,0,0,0,0,0,0,0,0,0,0,0,0,0,0,0,0,0,"OK","OK","OK","OK"]
[null,null,null,null,0,0,0,0,0,0,0,0,0,0,0,0,0,0,0,0,0,0,"OK","OK","OK","OK"]
[null,null,null,null,0,0,0,0,0,0,0,0,0,0,0,0,0,0,0,0,0,0,"OK","OK","OK","OK"]
[null,null,null,null,0,0,0,0,0,0,0,0,0,0,0,0,0,0,0,0,0,0,"OK","OK","OK","OK"]
[null,null,null,null,0,0,0,0,0,0,0,0,0,0,0,0,0,0,0,0,0,0,"OK","OK","OK","OK"]
[null,null,null,null,0,0,0,0,0,0,0,0,0,0,0,0,0,0,0,0,0,0,"OK","OK","OK","OK"]
[null,null,null,null,0,0,0,0,0,0,0,0,0,0,0,0,0,0,0,0,0,0,"OK","OK","OK","OK"]
[null,null,null,null,0,0,0,0,0,0,0,0,0,0,0,0,0,0,0,0,0,0,"OK","OK","OK","OK"]
[null,null,null,null,0,0,0,0,0,0,0,0,0,0,0,0,0,0,0,0,0,0,"OK","OK","OK","OK"]
[null,null,null,null,0,0,0,0,0,0,0,0,0,0,0,0,0,0,0,0,0,0,"OK","OK","OK","OK"]
[null,null,null,null,0,0,0,0,0,0,0,0,0,0,0,0,0,0,0,0,0,0,"OK","OK","OK","OK"]
[null,null,null,null,0,0,0,0,0,0,0,0,0,0,0,0,0,0,0,0,0,0,"OK","OK","OK","OK"]
[null,null,null,null,0,0,0,0,0,0,0,0,0,0,0,0,0,0,0,0,0,0,"OK","OK","OK","OK"]
[null,null,null,null,0,0,0,0,0,0,0,0,0,0,0,0,0,{"$f":"IF(G159=0,0,Q159/G159)","v":0},{"$f":"IF(SUM(H159:J159)=0,0,Q159/SUM(H159:J159))","v":0},{"$f":"IF(L159=0,0, O159*100/L159)","v":0},{"$f":"IF(G159=0,0,SUM(H159:J159)/G159)","v":0},0,"OK",{"$f":"IF(OR(L159>(N159),(AND(L159=0,N159=0))),\"OK\",\"Err\")","v":"OK"},{"$f":"IF(OR(L159>(O159),(AND(L159=0,O159=0))),\"OK\",\"Err\")","v":"OK"},{"$f":"IF(P159>=(0),\"OK\",\"Err\")","v":"OK"}]
[null,null,null,null,0,0,0,0,0,0,0,0,0,0,0,0,0,0,0,0,0,0,"OK","OK","OK","OK"]
[null,null,null,null,0,0,0,0,0,0,0,0,0,0,0,0,0,0,0,0,0,0,"OK","OK","OK","OK"]
[null,null,null,null,0,0,0,0,0,0,0,0,0,0,0,0,0,0,0,0,0,0,"OK","OK","OK","OK"]
[null,null,null,null,0,0,0,0,0,0,0,0,0,0,0,0,0,0,0,0,0,0,"OK","OK","OK","OK"]
[null,null,null,null,0,0,0,0,0,0,0,0,0,0,0,0,0,0,0,0,0,0,"OK","OK","OK","OK"]
[null,null,null,null,0,0,0,0,0,0,0,0,0,0,0,0,0,0,0,0,0,0,"OK","OK","OK","OK"]
[null,null,null,null,0,0,0,0,0,0,0,0,0,0,0,0,0,0,0,0,0,0,"OK","OK","OK","OK"]
[null,null,null,null,0,0,0,0,0,0,0,0,0,0,0,0,0,0,0,0,0,0,"OK","OK","OK","OK"]
[null,null,null,null,0,0,0,0,0,0,0,0,0,0,0,0,0,0,0,0,0,0,"OK","OK","OK","OK"]
[null,null,null,null,0,0,0,0,0,0,0,0,0,0,0,0,0,0,0,0,0,0,"OK","OK","OK","OK"]
[null,null,null,null,0,0,0,0,0,0,0,0,0,0,0,0,0,0,0,0,0,0,"OK","OK","OK","OK"]
[null,null,null,null,0,0,0,0,0,0,0,0,0,0,0,0,0,0,0,0,0,0,"OK","OK","OK","OK"]
[null,null,null,null,0,0,0,0,0,0,0,0,0,0,0,0,0,0,0,0,0,0,"OK","OK","OK","OK"]
[null,null,null,null,0,0,0,0,0,0,0,0,0,0,0,0,0,0,0,0,0,0,"OK","OK","OK","OK"]
[null,null,null,null,0,0,0,0,0,0,0,0,0,0,0,0,0,0,0,0,0,0,"OK","OK","OK","OK"]
[null,null,null,null,0,0,0,0,0,0,0,0,0,0,0,0,0,0,0,0,0,0,"OK","OK","OK","OK"]
[null,null,null,null,0,0,0,0,0,0,0,0,0,0,0,0,0,0,0,0,0,0,"OK","OK","OK","OK"]
[null,null,null,null,0,0,0,0,0,0,0,0,0,0,0,0,0,0,0,0,0,0,"OK","OK","OK","OK"]
[null,null,null,null,0,0,0,0,0,0,0,0,0,0,0,0,0,0,0,0,0,0,"OK","OK","OK","OK"]
[null,null,null,null,0,0,0,0,0,0,0,0,0,0,0,0,0,0,0,0,0,0,"OK","OK","OK","OK"]
[null,null,null,null,0,0,0,0,0,0,0,0,0,0,0,0,0,0,0,0,0,0,"OK","OK","OK","OK"]
[null,null,null,null,0,0,0,0,0,0,0,0,0,0,0,0,0,0,0,0,0,0,"OK","OK","OK","OK"]
[null,null,null,null,0,0,0,0,0,0,0,0,0,0,0,0,0,0,0,0,0,0,"OK","OK","OK","OK"]
[null,null,null,null,0,0,0,0,0,0,0,0,0,0,0,0,0,0,0,0,0,0,"OK","OK","OK","OK"]
[null,null,null,null,0,0,0,0,0,0,0,0,0,0,0,0,0,0,0,0,0,0,"OK","OK","OK","OK"]
[null,null,null,null,0,0,0,0,0,0,0,0,0,0,0,0,0,0,0,0,0,0,"OK","OK","OK","OK"]
[null,null,null,null,0,0,0,0,0,0,0,0,0,0,0,0,0,0,0,0,0,0,"OK","OK","OK","OK"]
[null,null,null,null,0,0,0,0,0,0,0,0,0,0,0,0,0,0,0,0,0,0,"OK","OK","OK","OK"]
[null,null,null,null,0,0,0,0,0,0,0,0,0,0,0,0,0,0,0,0,0,0,"OK","OK","OK","OK"]
[null,null,null,null,0,0,0,0,0,0,0,0,0,0,0,0,0,0,0,0,0,0,"OK","OK","OK","OK"]
[null,null,null,null,0,0,0,0,0,0,0,0,0,0,0,0,0,0,0,0,0,0,"OK","OK","OK","OK"]
[null,null,null,null,0,0,0,0,0,0,0,0,0,0,0,0,0,0,0,0,0,0,"OK","OK","OK","OK"]
[null,null,null,null,0,0,0,0,0,0,0,0,0,0,0,0,0,0,0,0,0,0,"OK","OK","OK","OK"]
[null,null,null,null,0,0,0,0,0,0,0,0,0,0,0,0,0,0,0,0,0,0,"OK","OK","OK","OK"]
[null,null,null,null,0,0,0,0,0,0,0,0,0,0,0,0,0,0,0,0,0,0,"OK","OK","OK","OK"]
[null,null,null,null,0,0,0,0,0,0,0,0,0,0,0,0,0,0,0,0,0,0,"OK","OK","OK","OK"]
[null,null,null,null,0,0,0,0,0,0,0,0,0,0,0,0,0,0,0,0,0,0,"OK","OK","OK","OK"]
[null,null,null,null,0,0,0,0,0,0,0,0,0,0,0,0,0,0,0,0,0,0,"OK","OK","OK","OK"]
[]
["12. Însoţitori"]
["în spital"]
["Specificare","Rând","PATURI",null,"ÎNSOŢITORI",null,null,"Om-zile spitalizare (contabile)","INDICI"]
[null,null,"Existente la sfărşitul anului","Media anuală","Aflaţi","Intraţi","Ieşiţi",null,"Utilizarea paturilor","Durata medie de spitalizare","Rămaşi"]
["A","B",1,2,3,4,5,6,7,8,9]
["Total",1,{"$f":"SUM(C205:C206)","v":0},0,0,0,0,0,{"$f":"IF(D204=0,0,+H204/D204)","v":0},{"$f":"IF((+E204+F204)=0,0,+H204/(+E204+F204))","v":0},{"$f":"SUM(K205:K206)","v":0}]
["Însoţitori pentru copii",2,0,0,0,0,0,0,{"$f":"IF(D205=0,0,+H205/D205)","v":0},{"$f":"IF((+E205+F205)=0,0,+H205/(+E205+F205))","v":0},{"$f":"+E205+F205-G205","v":0},{"$f":"IF(K205>=(0),\"OK!\", \"Err\")","v":"OK!"}]
["Însoţitori  pentru adulţi",3,0,0,0,0,0,0,0,{"$f":"IF((+E206+F206)=0,0,+H206/(+E206+F206))","v":0},{"$f":"+E206+F206-G206","v":0},{"$f":"IF(K206>=(0),\"OK!\", \"Err\")","v":"OK!"}]
[]
["13. Activitatea serviciului de radiologie"]
[]
["Specificare","Rând","Nr. aparate radiografice","Nr.zile de funcţionare a aparatelor"]
["A","B","01","02"]
["Total",1,{"$f":"SUM(C213:C214)","v":0},{"$f":"SUM(D213:D214)","v":0}]
["Urban",2,0,0]
["Rural ",3,0,0]

{"sheet":"c1","index":7,"n_rows":122,"n_cols":16,"rows_kept":122,"cut":false,"hidden":false,"merged":[[42,10,42,11],[42,12,42,13],[42,14,42,15],[109,8,109,9],[45,0,45,1],[109,0,110,0],[109,1,110,1],[109,2,109,3],[109,4,109,5],[109,6,109,7],[28,0,28,1],[29,0,31,0],[32,0,34,0],[39,0,39,15],[41,0,43,0],[41,1,43,1],[41,2,41,3],[41,4,43,4],[41,5,43,5],[41,6,43,6],[41,7,43,7],[41,8,41,11],[41,12,41,15],[42,2,43,2],[42,3,43,3],[42,8,42,9],[24,3,24,6],[24,7,24,10],[25,3,26,3],[25,4,25,6],[25,7,26,7],[25,8,25,10],[24,2,26,2],[5,0,5,10],[9,0,11,0],[9,1,11,1],[9,2,11,2],[9,3,9,6],[9,7,9,10],[10,3,11,3],[10,4,10,6],[10,7,11,7],[10,8,10,10],[13,0,13,1],[14,0,16,0],[17,0,19,0],[24,0,26,0],[24,1,26,1]]}
[]
[]
[]
[]
[]
[" Cap.1. ACTIVITATEA CABINETELOR  MEDICAL E DE  FAMILIE, STOMATOLOGICE ŞI DE SPECIALITATE  (URBAN / RURAL)"]
[]
["1. Consultaţii şi tratamente în cabinetele medicale individuale"]
[]
["Mediul","Specificare","Rând","Consultaţii",null,null,null,"Tratamente"]
[null,null,null,"Total consultaţii","din care:",null,null,"Total tratamente","din care:"]
[null,null,null,null,"Medicină de familie","Stomatologie","Alte specialităţi",null,"Medicină de familie","Stomatologie","Alte specialităţi"]
["A","B","C",1,2,3,4,5,6,7,8]
["Total ",null,1,0,0,0,0,0,0,0,0]
["urban","Adulţi    15 ani+",2,0,null,null,null,0]
[null,"Copii    0-14 ani",3,0,null,null,null,0]
[null,"din care: sub 1 an",4,0,null,null,null,0]
["rural","Adulţi    15 ani+",5,0,null,null,null,0]
[null,"Copii    0-14 ani",6,0,null,null,null,0]
[null,"din care: sub 1 an",7,0,null,null,null,0]
[]
[]
["2. Consultaţii şi tratamente în cabinetele din societăţile medicale civile"]
[]
["Mediul","Specificare","Rând","Consultaţii",null,null,null,"Tratamente"]
[null,null,null,"Total consultaţii","din care:",null,null,"Total tratamente","din care:"]
[null,null,null,null,"Medicină de familie","Stomatologie","Alte specialităţi",null,"Medicină de familie","Stomatologie","Alte specialităţi"]
["A","B","C",1,2,3,4,5,6,7,8]
["Total ",null,1,0,0,0,0,0,0,0,0]
["urban","Adulţi    15 ani+",2,0,null,null,null,0]
[null,"Copii    0-14 ani",3,0,null,null,null,0]
[null,"din care: sub 1 an",4,0,null,null,null,0]
["rural","Adulţi    15 ani+",5,0,null,null,null,0]
[null,"Copii    0-14 ani",6,0,null,null,null,0]
[null,"din care: sub 1 an",7,0,null,null,null,0]
[]
["Notă: Datele din pct.2 (cabinetele din societăţile medicale civile) nu se raportează şi la pct.1 (cabinetele medicale individuale)"]
[]
[]
["Centre de permanență"]
[]
["Nr. crt.","Denumire Centru de permanență","Număr Localități deservite",null,"Nr. cazuri rezolvate","Nr. cazuri trimise către unități spitalicești","Nr. medici","Nr. asistenți","Consultații",null,null,null,"Tratamente"]
[null,null,"U","R",null,null,null,null,"U",null,"R",null,"U",null,"R"]
[null,null,null,null,null,null,null,null,"adulți","copii","adulți","copii","adulți","copii","adulți","copii"]
["A","B",1,2,3,4,5,6,7,8,9,10,11,12,13,14]
[null,null,0,0,0,0,0,0,0,0,0,0,0,0,0,0]
[]
[]
[]
[]
[]
[]
[]
[]
[]
[]
[]
[]
[]
[]
[]
[]
[]
[]
[]
[]
[]
[]
[]
[]
[]
[]
[]
[]
[]
[]
[]
[]
[]
[]
[]
[]
[]
[]
[]
[]
[]
[]
[]
[]
[]
[]
[]
[]
[]
[]
[]
[]
[]
[]
[]
[]
[]
[]
[]
[]
[null,"Cabinete de liberă practică pentru serviciile publice conexe actului medical"]
[]
[]
["Nr. crt.","Formă de organizare","Cabinet de practică individual",null,"Cabinete de practică grupate",null,"Cabinete de practică asociate",null,"Societate civilă de practică"]
[null,null,"cu personalitate juridică","fără personalitate juridică","cu personalitate juridică","fără personalitate juridică","cu personalitate juridică","fără personalitate juridică","cu personalitate juridică","fără personalitate juridică"]
[1,"Tehnică dentară"]
[2,"Fizioterapie",0]
[3,"Psihologie"]
[4,"Logopedie"]
[5,"Sociologie"]
[6,"Optica-optometrie"]
[7,"Protezare-ortezare"]
[8,"Protezarea auditivă"]
[9,"Audiologie"]
[10,"Terapie vocală"]
[11,"Nutriție și dietetică"]

{"sheet":"c4","index":8,"n_rows":35,"n_cols":17,"rows_kept":35,"cut":false,"hidden":false,"merged":[[13,4,15,4],[13,14,15,14],[14,6,15,6],[12,10,15,10],[13,5,15,5],[13,9,15,9],[31,0,32,0],[31,1,31,3],[13,11,15,11],[13,12,15,12],[13,13,15,13],[21,0,23,0],[21,2,22,3],[21,4,22,5],[22,1,23,1],[12,0,15,0],[12,1,12,3],[13,1,14,2],[13,3,15,3],[14,7,14,8],[13,6,13,8],[12,4,12,9]]}
[]
[]
[]
[]
[]
["MS.60.4.4A"]
["Cap.4. Activitatea preventoriului"]
[]
[]
[]
["I.  Mişcarea internaţilor"]
[]
["Denumirea secţiei/compartimentului","Număr paturi",null,null,"Număr bolnavi",null,null,null,null,null,"Om-zile spitalizare","Indici"]
[null,"Existente la sfârşitul anului",null,"Media anuală a paturilor","Aflaţi","Intraţi","Ieşiţi",null,null,"Rămaşi",null,"Utilizarea paturilor","Durata medie de spitalizare","Mortalitatea în spitale","Rulajul (bolnav/pat)"]
[null,null,null,null,null,null,"Total","din care:"]
[null,"Urban","Rural",null,null,null,null,"asigurați","decedaţi"]
["A",1,2,3,4,5,6,7,8,9,10,11,12,13,14]
["Total",0,0,0,0,0,0,0,0,{"$f":"+E18+F18-G18","v":0},0,{"$f":"IF(D18=0,0,+K18/D18)","v":0},{"$f":"IF(SUM(E18:F18)=0,0,+K18/SUM(E18:F18))","v":0},{"$f":"IF(G18=0,0,+I18*100/G18)","v":0},{"$f":"IF(D18=0,0,SUM(E18:F18)/D18)","v":0},{"$f":"IF(OR(G18>(I18),(AND(G18=0,I18=0))),\"OK\",\"Err\")","v":"OK"},{"$f":"IF(J18>=(0),\"OK\",\"Err\")","v":"OK"}]
[]
["2. Cheltuieli bugetare"]
[]
["Total cheltuieli efectuate","din care:","Total cheltuieli ce revin pe:",null,"Cheltuieli pentru medicamente ce revin pe:"]
[null,"pentru medicamente"]
[null,null,"1 pat","1 copil","1 pat","1 copil"]
[1,2,3,4,5,6]
[0,0,{"$f":"IF(D18=0,0,+A26/D18)","v":0},{"$f":"IF((+E18+F18)=0,0,+A26/(+E18+F18))","v":0},{"$f":"IF(D18=0,0,+B26/D18)","v":0},{"$f":"IF((+E18+F18)=0,0,+B26/(+E18+F18))","v":0}]
[null,{"$f":"IF(OR(A26>(B26),(AND(A26=0,B26=0))),\"OK\",\"Err\")","v":"OK"}]
[]
["3. Morbiditate"]
["Incidenţa (îmbolnăviri- cazuri noi)"]
[]
["Total","din care:"]
[null,"Boli infecţioase","Bolile aparatului respirator","Bolile aparatului digestiv"]
[1,2,3,4]
[{"$f":"SUM(B35:D35)","v":0},0,0,0]

{"sheet":"c7","index":9,"n_rows":28,"n_cols":8,"rows_kept":28,"cut":false,"hidden":false,"merged":[[8,0,10,0],[8,1,10,1],[8,2,10,2],[8,3,8,5],[8,6,9,7],[9,3,10,3],[9,4,9,5]]}
[]
[]
[]
[]
["MS.60.4.4A"]
["CAP.7  ACTIVITATEA STAŢIEI DE SALVARE"]
[]
["1. Staţia de salvare (autosanitare)"]
["Nr. autosanitare la sfârşit de an","Ore rulaj","Nr. Km parcurşi","Nr. solicitări",null,null,"Nr. bolnavi"]
[null,null,null,"Total","din care: "]
[null,null,null,null,"rezolvate","alte situații","Transportaţi ","Primul ajutor acordat la locul solicitării fără pacienți transportaţi"]
[1,2,3,4,5,6,7,8]
[0,0,0,{"$f":"+E13+F13","v":0},0,0,0,0]
[]
["2. Nave sanitare"]
["Nr. nave sanitare","Nr. bolnavi transportaţi","Nr. personal sanitar transportat pt. asistenţă","Nr. litri sânge transportaţi",null," "]
[1,2,3,4]
[0,0,0,0]
[]
["3. Salvamont                                                                                         "]
["Număr persoane asistate","din care: decedate"]
[1,2]
[0,0,{"$f":"IF(OR(A23>(B23),(AND(A23=0,B23=0))),\"OK!\",\"Err\")","v":"OK!"}]
[]
["4. Salvamar"]
["Număr persoane asistate","din care: decedate"]
[1,2]
[0,0,{"$f":"IF(OR(A28>(B28),(AND(A28=0,B28=0))),\"OK!\",\"Err\")","v":"OK!"}]

{"sheet":"c10","index":10,"n_rows":26,"n_cols":9,"rows_kept":26,"cut":false,"hidden":false,"merged":[[10,6,11,6],[10,7,11,7],[10,8,11,8],[16,0,16,2],[9,5,11,5],[9,6,9,8],[22,0,22,2],[8,0,8,1],[9,0,9,2],[9,3,11,3],[9,4,11,4],[10,0,11,0],[10,1,10,2]]}
[]
[]
[]
[]
[]
["MS.60.4.4A"]
["CAP.10  ACTIVITATEA LABORATORULUI DE MEDICINA LEGALĂ"]
[]
["1. Serviciu"]
["Număr expertize",null,null,"Nr. lucrări complementare (anatomo-pat., trimiteri la lab.)","Nr. expertize pentru avorturi delictuale","Nr. îmbălsămări","Număr analize"]
["Pe persoane vii (lovituri, viol etc.)","Pe cadavre (oase, autopsii, exhumări etc.)",null,null,null,null,"Toxicologice","Biochimice şi criminalistice","Anatomo-patologice"]
[null,"Total","din care: decese mamă"]
[1,2,3,4,5,6,7,8,9]
[0,0,0,0,0,0,0,0,0]
[null,null,{"$f":"IF(OR(B14>(C14),(AND(B14=0, C14=0))),\"OK! \",\"Err\")","v":"OK! "}]
[]
["2. Comisia de avizare"]
["Nr. AVIZE (aprobate, respinse, cu completări)"]
[1]
[]
[]
["3. Consultaţii"]
["Total consultaţii, după domociliul donatorului"]
["Total","Urban","Rural"]
[1,2,3]
[{"$f":"+B26+C26","v":0},0,0]

{"sheet":"c14","index":11,"n_rows":47,"n_cols":24,"rows_kept":47,"cut":false,"hidden":false,"merged":[[14,19,15,19],[14,20,15,20],[13,21,14,23],[14,2,15,2],[14,3,15,3],[14,4,15,4],[14,5,15,5],[14,6,15,6],[14,7,15,7],[14,8,15,8],[14,9,15,9],[14,14,15,14],[13,14,13,20],[14,15,15,15],[14,16,15,16],[14,17,15,17],[14,18,15,18],[13,0,15,0],[13,1,15,1],[13,2,13,9],[13,10,14,12],[13,13,15,13]]}
[]
[]
[]
[]
[]
["MS.60.4.4A"]
["CAP 14. CHELTUIELILE BUGETARE ÎN UNTĂŢILE SANITARE"]
[]
[]
["Anul ....................."]
[]
["1. Cheltuieli realizate",null,{"$f":"IF(OR(AND(C18>=N18, C18>0),AND(C18=0,N18=0)),\"OK\",\"Err\")","v":"OK"},{"$f":"IF(OR(AND(D18>=O18, D18>0),AND(D18=0,O18=0)),\"OK\",\"Err\")","v":"OK"},{"$f":"IF(OR(AND(E18>=P18, E18>0),AND(E18=0,P18=0)),\"OK\",\"Err\")","v":"OK"},"OK","OK","OK","OK",{"$f":"IF(OR(AND(J18>=U18, U18>0),AND(J18=0,U18=0)),\"OK\",\"Err\")","v":"OK"},null,null,null,null,null,null,null,null,null,null,{"$f":"IF(U18<>(SUM(C27:X27)+SUM(A36:X36)+SUM(A45:F45)),\"Err\",\"OK\")","v":"OK"}]
[null,null,{"$f":"IF(OR(AND(C19>=N19, C19>0),AND(C19=0,N19=0)),\"OK\",\"Err\")","v":"OK"},{"$f":"IF(OR(AND(D19>=O19, D19>0),AND(D19=0,O19=0)),\"OK\",\"Err\")","v":"OK"},"OK","OK","OK","OK","OK",{"$f":"IF(OR(AND(J19>=U19, U19>0),AND(J19=0,U19=0)),\"OK\",\"Err\")","v":"OK"},null,null,null,null,null,null,null,null,null,null,{"$f":"IF(('c2Sp_Sext_cab_spital'!V130+'c3tbcSp_Sext'!V137)='c14'!U18,\"OK\",\"Err\")","v":"OK"}]
["Specificare","Rând","CHELTUIELI REALIZATE - TOTAL, din care pentru:",null,null,null,null,null,null,null,"Cheltuieli realizate în spital raportate la:",null,null,"Total cheltuieli pentru medicamente","din care, cheltuieli efectuate pentru:",null,null,null,null,null,null,"Cheltuieli efectuate pentru medicamente în spital raportate la:"]
[null,null,"TOTAL CHELTUIELI","Spitalizare de zi","Cabinete şcolare   şi studenţeşti","Dispensare tbc.","Unităţi ambulatorii de specialitate","Unităţi sanitare balneare","Camera de gardă UPU/CPU","Spitale      \n (sanatorii tbc.)",null,null,null,null,"Spitalizare de zi","Cabinete şcolare   şi studenţeşti","Dispensare tbc.","Unităţi ambulatorii de specialitate","Unităţi sanitare balneare","Camera de gardă UPU/CPU","Spitale \n(sanatorii tbc.)"]
[null,null,null,null,null,null,null,null,null,null,"un pat","un bolnav","o zi spitalizare",null,null,null,null,null,null,null,null,"un pat","un bolnav","o zi spitalizare"]
["A","B",1,2,3,4,5,6,7,8,9,10,11,12,13,14,15,16,17,18,19,20,21,22]
["TOTAL",1,{"$f":"SUM(D18:J18)","v":0},0,0,0,0,0,0,0,{"$f":"IFERROR((H18+J18)/('c2Sp_Sext_cab_spital'!G130+'c3tbcSp_Sext'!G137),\"0.00\")","v":"0.00"},{"$f":"IFERROR((+H18+J18)/('c2Sp_Sext_cab_spital'!H130+'c2Sp_Sext_cab_spital'!I130+'c3tbcSp_Sext'!H137+'c3tbcSp_Sext'!I137),\"0.00\")","v":"0.00"},{"$f":"IFERROR((+H18+J18)/('c2Sp_Sext_cab_spital'!Q130+'c3tbcSp_Sext'!Q137),\"0.00\")","v":"0.00"},{"$f":"SUM(O18:U18)","v":0},0,0,0,0,0,0,{"$f":"+SUM(C27:X27)+SUM(A36:X36)+SUM(A45:F45)","v":0},{"$f":"IFERROR((+S18+U18)/('c2Sp_Sext_cab_spital'!G130+'c3tbcSp_Sext'!G137),\"0.00\")","v":"0.00"},{"$f":"IFERROR((+S18+U18)/('c2Sp_Sext_cab_spital'!H130+'c2Sp_Sext_cab_spital'!I130+'c3tbcSp_Sext'!H137+'c3tbcSp_Sext'!I137),\"0.00\")","v":"0.00"},{"$f":"IFERROR((+S18+U18)/('c2Sp_Sext_cab_spital'!Q130+'c3tbcSp_Sext'!Q137),\"0.00\")","v":"0.00"}]
["Clinic",2,{"$f":"SUM(D19:J19)","v":0},0,0,0,0,0,0,0,0,0,0,{"$f":"SUM(O19:U19)","v":0},0,0,0,0,0,0,{"$f":"+SUM(C28:X28)+SUM(A37:X37)+SUM(A46:F46)","v":0},0,0,0]
[null,null,{"$f":"IF(C19<=C18,\"OK\",\"ERR\")","v":"OK"},{"$f":"IF(D19<=D18,\"OK\",\"ERR\")","v":"OK"},"OK","OK","OK","OK","OK",{"$f":"IF(J19<=J18,\"OK\",\"ERR\")","v":"OK"},null,null,null,{"$f":"IF(N19<=N18,\"OK\",\"ERR\")","v":"OK"},"OK","OK","OK","OK","OK","OK","OK"]
[]
[]
["2. Repartizarea cheltuielilor pentru medicamente din spital pe secţiile şi compartimentele componente "]
[]
["Specificare","Rând","ATI","ATI COVID","ATI COVID COPII","Boli infecţioase","Boli profesionale  ","Cardiologie","Chirurgie cardio-vasculară","Chirurgie generală","Chirurgie maxilo- facială","Chirurgie pediatrică","Chirurgie plastică şi reparatorie","Chirurgie toracică","Chirurgie toracică  - tbc","Cronici","Dermato-venerologie","Diabet zaharat, nutriţie şi boli de metabolism","Endocrinologie","Gastro-enterologie","Geriatrie şi gerontologie","Ginecologie","Hematologie","Imunologie clinică şi alergologie"]
["A","B",1,2,3,4,5,6,7,8,9,10,11,12,13,14,15,16,17,18,19,20,21,22]
["TOTAL",1,0,0,0,0,0,0,0,0,0,0,0,0,0,0,0,0,0,0,0,0,0,0]
["CLINIC",2,0,0,0,0,0,0,0,0,0,0,0,0,0,0,0,0,0,0,0,0,0,0]
[null,null,{"$f":"IF(C28<=C27,\"OK\",\"ERR\")","v":"OK"},{"$f":"IF(D28<=D27,\"OK\",\"ERR\")","v":"OK"},"OK","OK","OK","OK","OK","OK","OK","OK","OK","OK","OK","OK","OK","OK","OK","OK","OK","OK","OK","OK"]
[]
[]
[]
[]
["Medicină generală","Medicină internă","Nefrologie","Neonatologie şi prematuri","Neurochirurgie","Neurologie","Obstetrică","Obstetrică ginecologie","Oftalmologie","Oncologie medicală","O.R.L.","Ortopedie şi traumatologie","Pediatrie","Pneumologie","Pneumologie tbc","Psihiatrie","Psihiatrie acuţi","Psihiatrie cronici","Recuperare medicală","Recuperare neuro-psiho-motorie","Recuperare pediatrică","Recuperare medicină fizică şi balneologie","Reumatologie","Tbc. osteoarticular"]
[23,24,25,26,27,28,29,30,31,32,33,34,35,36,37,38,39,40,41,42,43,44,45,46]
[0,0,0,0,0,0,0,0,0,0,0,0,0,0,0,0,0,0,0,0,0,0,0,0]
[0,0,0,0,0,0,0,0,0,0,0,0,0,0,0,0,0,0,0,0,0,0,0,0]
[{"$f":"IF(A37<=A36,\"OK\",\"ERR\")","v":"OK"},{"$f":"IF(B37<=B36,\"OK\",\"ERR\")","v":"OK"},"OK","OK","OK","OK","OK","OK","OK","OK","OK","OK","OK","OK","OK","OK","OK","OK","OK","OK","OK","OK","OK","OK"]
[]
[]
[]
[]
["Toxicologie","Urologie","Alte","COVID","COVID COPII","Genetică Medicală"]
[47,48,49,50,51,52]
[0,0,0,0,0,0]
[0,0,0,0,0,0]
[{"$f":"IF(A46<=A45,\"OK\",\"ERR\")","v":"OK"},{"$f":"IF(B46<=B45,\"OK\",\"ERR\")","v":"OK"},"OK","OK","OK","OK"]

{"sheet":"c15","index":12,"n_rows":265,"n_cols":122,"rows_kept":265,"cut":false,"hidden":false,"merged":[[178,0,178,1],[177,116,177,117],[178,116,178,117],[263,0,263,1],[104,112,104,113],[102,12,102,113],[10,88,10,89],[10,72,11,72],[10,73,10,74],[10,75,11,75],[10,76,10,77],[10,78,11,78],[102,114,105,114],[103,105,103,107],[103,108,103,110],[103,111,103,113],[104,105,105,105],[104,106,104,107],[104,108,105,108],[104,109,104,110],[104,111,105,111],[103,30,103,32],[103,33,103,35],[103,36,103,38],[248,0,248,1],[249,0,249,1],[250,0,250,1],[251,0,251,1],[252,0,252,1],[253,0,253,1],[242,0,242,1],[243,0,243,1],[244,0,244,1],[245,0,245,1],[246,0,246,1],[247,0,247,1],[260,0,260,1],[261,0,261,1],[262,0,262,1],[264,0,264,1],[254,0,254,1],[255,0,255,1],[256,0,256,1],[257,0,257,1],[258,0,258,1],[259,0,259,1],[236,0,236,1],[237,0,237,1],[238,0,238,1],[239,0,239,1],[240,0,240,1],[241,0,241,1],[229,0,229,1],[230,0,230,1],[231,0,231,1],[233,0,233,1],[234,0,234,1],[235,0,235,1],[232,0,232,1],[222,0,222,1],[223,0,223,1],[225,0,225,1],[226,0,226,1],[227,0,227,1],[228,0,228,1],[216,0,216,1],[217,0,217,1],[218,0,218,1],[219,0,219,1],[220,0,220,1],[221,0,221,1],[224,0,224,1],[212,0,212,1],[213,0,213,1],[214,0,214,1],[215,0,215,1],[204,0,204,1],[205,0,205,1],[206,0,206,1],[207,0,207,1],[208,0,208,1],[209,0,209,1],[203,0,203,1],[192,0,192,1],[193,0,193,1],[194,0,194,1],[195,0,195,1],[196,0,196,1],[197,0,197,1],[210,0,210,1],[211,0,211,1],[198,0,198,1],[199,0,199,1],[200,0,200,1],[201,0,201,1],[202,0,202,1],[188,19,188,20],[188,21,189,21],[188,22,188,23],[186,2,189,2],[186,3,186,5],[187,18,187,20],[187,21,187,23],[187,24,187,26],[187,27,187,29],[188,6,189,6],[187,3,189,3],[187,4,189,4],[187,5,189,5],[188,18,189,18],[190,0,190,1],[191,0,191,1],[188,15,189,15],[188,16,188,17],[188,24,189,24],[188,25,188,26],[188,27,189,27],[188,28,188,29],[174,0,174,1],[175,0,175,1],[176,0,176,1],[177,0,177,1],[179,0,179,1],[186,0,189,1],[188,7,188,8],[188,9,189,9],[188,10,188,11],[188,12,189,12],[188,13,188,14],[187,6,187,8],[187,9,187,11],[187,12,187,14],[187,15,187,17],[186,24,186,29],[168,0,168,1],[169,0,169,1],[170,0,170,1],[171,0,171,1],[172,0,172,1],[173,0,173,1],[162,0,162,1],[163,0,163,1],[164,0,164,1],[165,0,165,1],[166,0,166,1],[167,0,167,1],[156,0,156,1],[157,0,157,1],[158,0,158,1],[159,0,159,1],[160,0,160,1],[161,0,161,1],[150,0,150,1],[151,0,151,1],[152,0,152,1],[153,0,153,1],[154,0,154,1],[155,0,155,1],[143,0,143,1],[144,0,144,1],[145,0,145,1],[146,0,146,1],[148,0,148,1],[149,0,149,1],[136,0,136,1],[137,0,137,1],[138,0,138,1],[139,0,139,1],[141,0,141,1],[142,0,142,1],[140,0,140,1],[147,0,147,1],[130,0,130,1],[131,0,131,1],[132,0,132,1],[133,0,133,1],[134,0,134,1],[135,0,135,1],[124,0,124,1],[125,0,125,1],[126,0,126,1],[127,0,127,1],[128,0,128,1],[129,0,129,1],[118,0,118,1],[119,0,119,1],[120,0,120,1],[121,0,121,1],[122,0,122,1],[123,0,123,1],[112,0,112,1],[113,0,113,1],[114,0,114,1],[115,0,115,1],[116,0,116,1],[117,0,117,1],[106,0,106,1],[107,0,107,1],[108,0,108,1],[109,0,109,1],[110,0,110,1],[111,0,111,1],[104,13,104,14],[104,15,105,15],[104,16,104,17],[103,3,105,3],[103,4,105,4],[103,5,105,5],[103,6,105,6],[103,7,103,8],[103,9,105,9],[103,10,103,11],[103,12,105,12],[103,13,103,14],[103,15,103,17],[103,27,103,29],[103,102,103,104],[104,7,104,8],[103,57,103,59],[103,60,103,62],[103,63,103,65],[103,69,103,71],[103,72,103,74],[103,75,103,77],[103,78,103,80],[103,81,103,83],[103,48,103,50],[103,51,103,53],[103,54,103,56],[103,87,103,89],[103,90,103,92],[103,93,103,95],[103,96,103,98],[103,99,103,101],[103,66,103,68],[103,39,103,41],[103,42,103,44],[103,45,103,47],[103,84,103,86],[80,0,80,1],[81,0,81,1],[82,0,85,0],[86,0,92,0],[93,0,93,1],[94,0,94,1],[104,10,104,11],[56,21,56,23],[56,24,56,26],[103,18,103,20],[103,21,103,23],[103,24,103,26],[95,0,95,1],[96,0,96,1],[102,0,105,1],[102,2,105,2],[102,3,102,5],[102,6,102,11],[57,28,57,29],[59,0,59,1],[60,0,60,1],[61,0,61,1],[62,0,62,1],[63,0,79,0],[57,19,57,20],[57,21,58,21],[57,22,57,23],[57,24,58,24],[57,25,57,26],[57,27,58,27],[49,0,49,1],[49,112,49,113],[55,0,58,1],[55,2,58,2],[55,3,55,5],[55,24,55,29],[56,3,58,3],[56,4,58,4],[56,5,58,5],[56,6,56,8],[56,27,56,29],[57,6,58,6],[57,7,57,8],[57,9,58,9],[57,10,57,11],[57,12,58,12],[57,13,57,14],[57,15,58,15],[57,16,57,17],[57,18,58,18],[56,9,56,11],[56,12,56,14],[56,15,56,17],[56,18,56,20],[46,0,46,1],[46,112,46,113],[47,0,47,1],[47,112,47,113],[48,0,48,1],[48,112,48,113],[34,0,34,1],[34,112,34,113],[35,0,38,0],[35,112,38,112],[39,0,45,0],[39,112,45,112],[15,0,15,1],[15,112,15,113],[16,0,32,0],[16,112,32,112],[33,0,33,1],[33,112,33,113],[12,0,12,1],[12,112,12,113],[13,0,13,1],[13,112,13,113],[14,0,14,1],[14,112,14,113],[10,79,10,80],[10,18,11,18],[10,19,10,20],[10,21,11,21],[10,22,10,23],[10,24,11,24],[10,25,10,26],[10,45,11,45],[10,46,10,47],[10,48,11,48],[10,36,11,36],[10,37,10,38],[10,39,11,39],[10,40,10,41],[10,42,11,42],[10,43,10,44],[10,58,10,59],[10,60,11,60],[10,61,10,62],[10,63,11,63],[10,64,10,65],[10,66,11,66],[10,67,10,68],[10,69,11,69],[10,70,10,71],[10,54,11,54],[10,55,10,56],[10,57,11,57],[10,27,11,27],[10,28,10,29],[10,30,11,30],[10,31,10,32],[10,33,11,33],[10,34,10,35],[10,49,10,50],[10,51,11,51],[10,52,10,53],[9,116,11,116],[9,117,11,117],[10,6,11,6],[10,7,10,8],[10,9,11,9],[10,10,10,11],[10,12,11,12],[10,13,10,14],[10,15,11,15],[10,16,10,17],[9,87,9,89],[9,90,9,92],[9,93,9,95],[9,112,11,113],[9,114,11,114],[9,115,11,115],[10,90,11,90],[10,91,10,92],[10,93,11,93],[10,94,10,95],[9,69,9,71],[9,72,9,74],[9,75,9,77],[9,78,9,80],[8,0,11,1],[8,2,11,2],[8,3,8,5],[9,3,11,3],[9,4,11,4],[9,5,11,5],[9,6,9,8],[9,9,9,11],[9,12,9,14],[8,6,8,104],[9,96,9,98],[10,96,11,96],[10,97,10,98],[9,99,9,101],[10,99,11,99],[10,100,10,101],[9,102,9,104],[10,102,11,102],[10,103,10,104],[10,81,11,81],[10,82,10,83],[10,84,11,84],[10,85,10,86],[10,87,11,87],[9,81,9,83],[9,84,9,86],[9,51,9,53],[9,54,9,56],[9,57,9,59],[9,60,9,62],[9,63,9,65],[9,66,9,68],[9,15,9,17],[9,18,9,20],[9,21,9,23],[9,24,9,26],[9,27,9,29],[9,30,9,32],[9,33,9,35],[9,36,9,38],[9,39,9,41],[9,42,9,44],[9,45,9,47],[9,48,9,50]]}
[]
[]
[]
[]
[]
["MS.60.4.4A"]
["Cap.15. PERSONAL MEDIU SANITAR, PERSONAL AUXILIAR SANITAR, MUNCITORI, PERSONAL DE SERVIRE ŞI PERSONAL DIN APARATUL FUNCŢIONAL PE CATEGORII DE UNITĂŢI",null,null,null,null,null,null,null,null,null,null,null,null,null,null,null,null,null,null,null,null,null,null,null,null,null,null,null,null,null,null,null,null,null,null,null,null,null,null,null,null,null,null,null,null,null,null,null,null,null,null,null,null,null,null,null,null,null,null,null,null,null,null,null,null,null,null,null,null,null,null,null,null,null,null,null,null,null,null,null,null,null,null,null,null,null,null,null,null,null,null,null,null,null,null,null,null,null,null,null,null,null,null,null,null,null,null,null,null,null,null,null,"verificare intre tabelele A si B"]
["A"]
["CATEGORII DE PERSONAL",null,"Randul","TOTAL",null,null,"            Repartizarea personalului sanitar mediu şi auxiliar pe tipuri de unităţi"]
[null,null,null,"TOTAL","MASCULIN","FEMININ","spital",null,null,"Centru de sănătate cu paturi de spital",null,null,"Sanatorii TBC",null,null,"Preventorii",null,null,"Sanatorii balneare",null,null,"Dispensare medicale",null,null,"Cabinete medicale şcolare",null,null,"Cabinete medicale  studenţeşti",null,null,"Cabinete med.  de medicină generală ",null,null,"Cabinete medicale de familie",null,null,"Farmacii",null,null,"Puncte farmaceutice",null,null,"Depozite farmaceutice",null,null,"Policlinici",null,null,"Centre de diag. şi tratatament",null,null,"Centre medicale de specialitate",null,null,"Ambulatorii de specialitate",null,null,"Ambulatorii integrate spitalului",null,null,"Cabinete stomatologice",null,null,"Cabinete medicale de specialitate",null,null,"Centre de sănătate",null,null,"Centre de sănătate mintală",null,null,"C.T.S.",null,null,"Laboratoare medicale",null,null,"Laboratoare de tehnică dentară",null,null,"Institute, unităţi cercet. fără paturi",null,null,"MS, DSP, INSP",null,null,"Sanatorii nevroze/ neuropsihiatrie",null,null,"Salvare",null,null,"Alte tipuri de unităţi",null,null,"Societati civile medicale de familie",null,null,"Societati stomatologice civile medicale",null,null,"Societati civile medicale de specialitate",null,null,null,null,null,null,null,null,null,"CATEGORII DE PERSONAL",null,"Randul","TOTAL","MASCULIN","FEMININ"]
[null,null,null,null,null,null,"Total","din care:",null,"Total","din care:",null,"Total","din care:",null,"Total","din care:",null,"Total","din care:",null,"Total","din care:",null,"Total","din care:",null,"Total","din care:",null,"Total","din care:",null,"Total","din care:",null,"Total","din care:",null,"Total","din care:",null,"Total","din care:",null,"Total","din care:",null,"Total","din care:",null,"Total","din care:",null,"Total","din care:",null,"Total","din care:",null,"Total","din care:",null,"Total","din care:",null,"Total","din care:",null,"Total","din care:",null,"Total","din care:",null,"Total","din care:",null,"Total","din care:",null,"Total","din care:",null,"Total","din care:",null,"Total","din care:",null,"Total","din care:",null,"Total","din care:",null,"Total","din care:",null,"Total","din care:",null,"Total","din care:"]
[null,null,null,null,null,null,null,"masculin","feminin",null,"masculin","feminin",null,"masculin","feminin",null,"masculin","feminin",null,"masculin","feminin",null,"masculin","feminin",null,"masculin","feminin",null,"masculin","feminin",null,"masculin","feminin",null,"masculin","feminin",null,"masculin","feminin",null,"masculin","feminin",null,"masculin","feminin",null,"masculin","feminin",null,"masculin","feminin",null,"masculin","feminin",null,"masculin","feminin",null,"masculin","feminin",null,"masculin","feminin",null,"masculin","feminin",null,"masculin","feminin",null,"masculin","feminin",null,"masculin","feminin",null,"masculin","feminin",null,"masculin","feminin",null,"masculin","feminin",null,"masculin","feminin",null,"masculin","feminin",null,"masculin","feminin",null,"masculin","feminin",null,"masculin","feminin",null,"masculin","feminin",null,"masculin","feminin"]
["A",null,"B",1,2,3,4,5,6,7,8,9,10,11,12,13,14,15,16,17,18,19,20,21,22,23,24,25,26,27,28,29,30,31,32,33,34,35,36,37,38,39,40,41,42,43,44,45,46,47,48,49,50,51,52,53,54,55,56,57,58,59,60,61,62,63,64,65,66,67,68,69,70,71,72,73,74,75,76,77,78,79,80,81,82,83,84,85,86,87,88,89,90,91,92,93,94,95,96,97,98,99,100,101,102,null,null,null,null,null,null,null,"A",null,"B",1,2,3]
["TOTAL PERSONAL (rând  2+34+35+36+37)",null,1,{"$f":"+D15+SUM(D47:D50)","v":0},{"$f":"+E15+SUM(E47:E50)","v":0},0,0,0,0,{"$f":"+J15+SUM(J47:J50)","v":0},0,0,0,0,0,0,0,0,0,0,0,0,0,0,0,0,0,0,0,0,0,0,0,0,0,0,0,{"$f":"+AL15+SUM(AL47:AL50)","v":0},0,0,0,0,0,0,0,0,0,0,0,0,0,0,0,0,0,0,0,0,0,0,0,0,0,0,0,0,0,0,0,0,0,0,0,0,0,0,0,0,0,0,0,0,0,0,0,0,0,0,0,0,0,0,0,{"$f":"+CP15+SUM(CP47:CP50)","v":0},0,0,0,0,0,0,0,0,0,0,0,null,null,null,null,null,null,null,"TOTAL PERSONAL (rând 02+34+35+36+37)",null,1,{"$f":"+D61-D14","v":0},0,0]
["TOTAL PERSONAL MEDIU SANITAR        (rândurile   3; 21 – 33)",null,2,{"$f":"+D16+SUM(D34:D46)","v":0},0,0,0,0,0,0,0,0,0,0,0,0,0,0,0,0,0,0,0,0,0,0,0,0,0,0,0,0,0,0,0,0,0,0,0,0,0,0,0,0,0,0,0,0,0,0,0,0,0,0,0,0,0,0,0,0,0,0,0,0,0,0,0,{"$f":"+BP16+SUM(BP34:BP46)","v":0},0,0,0,0,0,0,0,0,0,0,0,0,0,0,0,0,0,0,0,0,0,0,0,0,0,0,0,{"$f":"+CR16+SUM(CR34:CR46)","v":0},{"$f":"+CS16+SUM(CS34:CS46)","v":0},0,{"$f":"+CU16+SUM(CU34:CU46)","v":0},{"$f":"+CV16+SUM(CV34:CV46)","v":0},0,{"$f":"+CX16+SUM(CX34:CX46)","v":0},{"$f":"+CY16+SUM(CY34:CY46)","v":0},0,{"$f":"+DA16+SUM(DA34:DA46)","v":0},null,null,null,null,null,null,null,"TOTAL PERSONAL MEDIU SANITAR        (rândurile 03; 21 – 33)",null,2,0,0,0]
["Asistenţi, surori –  TOTAL   (rând  4 – 20)",null,3,{"$f":"SUM(D17:D33)-D28","v":0},0,0,0,0,0,{"$f":"SUM(J17:J33)-J28","v":0},0,0,0,0,0,0,0,0,0,0,0,0,0,0,{"$f":"SUM(Y17:Y33)-Y28","v":0},0,0,0,0,0,0,0,0,0,0,0,0,0,0,0,0,0,0,0,0,0,0,0,0,0,0,0,0,0,0,0,0,0,0,0,0,0,0,0,0,0,0,0,0,0,0,0,0,0,0,0,0,0,0,0,0,0,0,0,0,0,0,0,{"$f":"SUM(CK17:CK33)-CK28","v":0},0,0,0,0,0,0,0,{"$f":"SUM(CS17:CS33)-CS28","v":0},0,0,0,0,0,0,0,0,null,null,null,null,null,null,null,"Asistenţi, surori –  TOTAL         (rând 04 – 20)",null,3,0,0,0]
["După specialitate","Medicale",4,{"$f":"+E17+F17","v":0},{"$f":"+H17+K17+N17+Q17+T17+W17+Z17+AC17+AF17+AI17+AL17+AO17+AR17+AU17+AX17+BA17+BD17+BG17+BJ17+BM17+BP17+BS17+BV17+BY17+CB17+CE17+CH17+CK17+CN17+CQ17+CT17+CW17+CZ17","v":0},{"$f":"+I17+L17+O17+R17+U17+X17+AA17+AD17+AG17+AJ17+AM17+AP17+AS17+AV17+AY17+BB17+BE17+BH17+BK17+BN17+BQ17+BT17+BW17+BZ17+CC17+CF17+CI17+CL17+CO17+CR17+CU17+CX17+DA17","v":0},0,{"$f":"+G17-I17","v":0},0,0,{"$f":"+J17-L17","v":0},0,0,{"$f":"+M17-O17","v":0},0,0,{"$f":"+P17-R17","v":0},0,0,{"$f":"+S17-U17","v":0},0,0,{"$f":"+V17-X17","v":0},0,0,{"$f":"+Y17-AA17","v":0},0,0,{"$f":"+AB17-AD17","v":0},0,0,{"$f":"+AE17-AG17","v":0},0,0,{"$f":"+AH17-AJ17","v":0},0,0,{"$f":"+AK17-AM17","v":0},0,0,{"$f":"+AN17-AP17","v":0},0,0,{"$f":"+AQ17-AS17","v":0},0,0,{"$f":"+AT17-AV17","v":0},0,0,{"$f":"+AW17-AY17","v":0},0,0,{"$f":"+AZ17-BB17","v":0},0,0,{"$f":"+BC17-BE17","v":0},0,0,{"$f":"+BF17-BH17","v":0},0,0,{"$f":"+BI17-BK17","v":0},0,0,{"$f":"+BL17-BN17","v":0},0,0,{"$f":"+BO17-BQ17","v":0},0,0,{"$f":"+BR17-BT17","v":0},0,0,{"$f":"+BU17-BW17","v":0},0,0,{"$f":"+BX17-BZ17","v":0},0,0,{"$f":"+CA17-CC17","v":0},0,0,{"$f":"+CD17-CF17","v":0},0,0,{"$f":"+CG17-CI17","v":0},0,0,{"$f":"+CJ17-CL17","v":0},0,0,{"$f":"+CM17-CO17","v":0},0,0,{"$f":"+CP17-CR17","v":0},0,0,{"$f":"+CS17-CU17","v":0},0,0,{"$f":"+CV17-CX17","v":0},0,0,{"$f":"+CY17-DA17","v":0},0,null,null,null,null,null,null,null,"După specialitate","Medicale",4,0,0,0]
[null,"Pediatrie",5,{"$f":"+E18+F18","v":0},{"$f":"+H18+K18+N18+Q18+T18+W18+Z18+AC18+AF18+AI18+AL18+AO18+AR18+AU18+AX18+BA18+BD18+BG18+BJ18+BM18+BP18+BS18+BV18+BY18+CB18+CE18+CH18+CK18+CN18+CQ18+CT18+CW18+CZ18","v":0},{"$f":"+I18+L18+O18+R18+U18+X18+AA18+AD18+AG18+AJ18+AM18+AP18+AS18+AV18+AY18+BB18+BE18+BH18+BK18+BN18+BQ18+BT18+BW18+BZ18+CC18+CF18+CI18+CL18+CO18+CR18+CU18+CX18+DA18","v":0},0,{"$f":"+G18-I18","v":0},0,0,{"$f":"+J18-L18","v":0},0,0,{"$f":"+M18-O18","v":0},0,0,{"$f":"+P18-R18","v":0},0,0,{"$f":"+S18-U18","v":0},0,0,{"$f":"+V18-X18","v":0},0,0,{"$f":"+Y18-AA18","v":0},0,0,{"$f":"+AB18-AD18","v":0},0,0,{"$f":"+AE18-AG18","v":0},0,0,{"$f":"+AH18-AJ18","v":0},0,0,{"$f":"+AK18-AM18","v":0},0,0,{"$f":"+AN18-AP18","v":0},0,0,{"$f":"+AQ18-AS18","v":0},0,0,{"$f":"+AT18-AV18","v":0},0,0,{"$f":"+AW18-AY18","v":0},0,0,{"$f":"+AZ18-BB18","v":0},0,0,{"$f":"+BC18-BE18","v":0},0,0,{"$f":"+BF18-BH18","v":0},0,0,{"$f":"+BI18-BK18","v":0},0,0,{"$f":"+BL18-BN18","v":0},0,0,{"$f":"+BO18-BQ18","v":0},0,0,{"$f":"+BR18-BT18","v":0},0,0,{"$f":"+BU18-BW18","v":0},0,0,{"$f":"+BX18-BZ18","v":0},0,0,{"$f":"+CA18-CC18","v":0},0,0,{"$f":"+CD18-CF18","v":0},0,0,{"$f":"+CG18-CI18","v":0},0,0,{"$f":"+CJ18-CL18","v":0},0,0,{"$f":"+CM18-CO18","v":0},0,0,{"$f":"+CP18-CR18","v":0},0,0,{"$f":"+CS18-CU18","v":0},0,0,{"$f":"+CV18-CX18","v":0},0,0,{"$f":"+CY18-DA18","v":0},0,null,null,null,null,null,null,null,null,"Pediatrie",5,0,0,0]
[null,"Obstetrică-ginecologie (moaşe)",6,0,{"$f":"+H19+K19+N19+Q19+T19+W19+Z19+AC19+AF19+AI19+AL19+AO19+AR19+AU19+AX19+BA19+BD19+BG19+BJ19+BM19+BP19+BS19+BV19+BY19+CB19+CE19+CH19+CK19+CN19+CQ19+CT19+CW19+CZ19","v":0},{"$f":"+I19+L19+O19+R19+U19+X19+AA19+AD19+AG19+AJ19+AM19+AP19+AS19+AV19+AY19+BB19+BE19+BH19+BK19+BN19+BQ19+BT19+BW19+BZ19+CC19+CF19+CI19+CL19+CO19+CR19+CU19+CX19+DA19","v":0},0,0,0,0,0,0,0,0,0,0,0,0,0,0,0,0,0,0,0,0,0,0,0,0,0,0,0,0,0,0,0,0,0,0,0,0,0,0,0,0,0,0,0,0,0,0,0,0,0,0,0,0,0,0,0,0,0,0,0,0,0,0,0,0,0,0,0,0,0,0,0,0,0,0,0,0,0,0,0,0,0,0,0,0,0,0,0,0,0,0,0,0,0,0,0,0,0,0,0,null,null,null,null,null,null,null,null,"Obstetrică-ginecologie (moaşe)",6,0,0,0]
[null,"Igienă",7,0,0,0,0,0,0,0,0,0,0,0,0,0,{"$f":"+P20-R20","v":0},0,0,{"$f":"+S20-U20","v":0},0,0,0,0,0,0,0,0,0,0,0,0,0,0,0,0,0,0,0,0,0,0,0,0,0,0,0,0,0,0,0,0,0,0,0,0,0,0,0,0,0,0,0,0,0,0,0,0,0,0,0,0,0,0,0,0,0,0,0,0,0,0,0,0,0,0,0,0,0,0,0,0,0,0,0,0,0,0,0,0,0,0,0,0,0,null,null,null,null,null,null,null,null,"Igienă",7,0,0,0]
[null,"Radiologie",8,0,0,0,0,0,0,0,0,0,0,0,0,0,0,0,0,0,0,0,0,0,0,0,0,0,0,0,0,0,0,0,0,0,0,0,0,0,0,0,0,0,0,0,0,0,0,0,0,0,0,0,0,0,0,0,0,0,0,0,0,0,0,0,0,0,0,0,0,0,0,0,0,0,0,0,0,0,0,0,0,0,0,0,0,0,0,0,0,0,0,0,0,0,0,0,0,0,0,0,0,0,0,null,null,null,null,null,null,null,null,"Radiologie",8,0,0,0]
[null,"Balneofizioterapie şi recuperare medicală",9,0,0,0,0,0,0,0,0,0,0,0,0,0,0,0,0,0,0,0,0,0,0,0,0,0,0,0,0,0,0,0,0,0,0,0,0,0,0,0,0,0,0,0,0,0,0,0,0,0,0,0,0,0,0,0,0,0,0,0,0,0,0,0,0,0,0,0,0,0,0,0,0,0,0,0,0,0,0,0,0,0,0,0,0,0,0,0,0,0,0,0,0,0,0,0,0,0,0,0,0,0,0,null,null,null,null,null,null,null,null,"Balneofizioterapie şi recuperare medicală",9,0,0,0]
[null,"Dietetică",10,0,0,0,0,0,0,0,0,0,0,0,0,0,0,0,0,0,0,0,0,0,0,0,0,0,0,0,0,0,0,0,0,0,0,0,0,0,0,0,0,0,0,0,0,0,0,0,0,0,0,0,0,0,0,0,0,0,0,0,0,0,0,0,0,0,0,0,0,0,0,0,0,0,0,0,0,0,0,0,0,0,0,0,0,0,0,0,0,0,0,0,0,0,0,0,0,0,0,0,0,0,0,null,null,null,null,null,null,null,null,"Dietetică",10,0,0,0]
[null,"Nutriţie şi diabet",11,0,0,0,0,0,0,0,0,0,0,0,0,0,0,0,0,0,0,0,0,0,0,0,0,0,0,0,0,0,0,0,0,0,0,0,0,0,0,0,0,0,0,0,0,0,0,0,0,0,0,0,0,0,0,0,0,0,0,0,0,0,0,0,0,0,0,0,0,0,0,0,0,0,0,0,0,0,0,0,0,0,0,0,0,0,0,0,0,0,0,0,0,0,0,0,0,0,0,0,0,0,0,null,null,null,null,null,null,null,null,"Nutriţie şi diabet",11,0,0,0]
[null,"Stomatologie",12,0,0,0,0,0,0,0,0,0,0,0,0,0,0,0,0,0,0,0,0,0,0,0,0,0,0,0,0,0,0,0,0,0,0,0,0,0,0,0,0,0,0,0,0,0,0,0,0,0,0,0,0,0,0,0,0,0,0,0,0,0,0,0,0,0,0,0,0,0,0,0,0,0,0,0,0,0,0,0,0,0,0,0,0,0,0,0,0,0,0,0,0,0,0,0,0,0,0,0,0,0,0,null,null,null,null,null,null,null,null,"Stomatologie",12,0,0,0]
[null,"Urgenţe medico- chirurgicale",13,0,0,0,0,0,0,0,0,0,0,0,0,0,0,0,0,0,0,0,0,0,0,0,0,0,0,0,0,0,0,0,0,0,0,0,0,0,0,0,0,0,0,0,0,0,0,0,0,0,0,0,0,0,0,0,0,0,0,0,0,0,0,0,0,0,0,0,0,0,0,0,0,0,0,0,0,0,0,0,0,0,0,0,0,0,0,0,0,0,0,0,0,0,0,0,0,0,0,0,0,0,0,null,null,null,null,null,null,null,null,"Urgenţe medico- chirurgicale",13,0,0,0]
[null,"Fiziokinetoterapeuţi, din care:",14,0,0,0,0,0,0,0,0,0,0,0,0,0,0,0,0,0,0,0,0,0,0,0,0,0,0,0,0,0,0,0,0,0,0,0,0,0,0,0,0,0,0,0,0,0,0,0,0,0,0,0,0,0,0,0,0,0,0,0,0,0,0,0,0,0,0,0,0,0,0,0,0,0,0,0,0,0,0,0,0,0,0,0,0,0,0,0,0,0,0,0,0,0,0,0,0,0,0,0,0,0,0,null,null,null,null,null,null,null,null,"Fiziokinetoterapeuţi, din care:",14,0,0,0]
[null,"                                           - fizioterapeuţi",15,0,0,0,0,0,0,0,0,0,0,0,0,0,0,0,0,0,0,0,0,0,0,0,0,0,0,0,0,0,0,0,0,0,0,0,0,0,0,0,0,0,0,0,0,0,0,0,0,0,0,0,0,0,0,0,0,0,0,0,0,0,0,0,0,0,0,0,0,0,0,0,0,0,0,0,0,0,0,0,0,0,0,0,0,0,0,0,0,0,0,0,0,0,0,0,0,0,0,0,0,0,0,null,null,null,null,null,null,null,null,"                                           - fizioterapeuţi",15,0,0,0]
[null,"Ocrotire",16,0,0,0,0,0,0,0,0,0,0,0,0,0,0,0,0,0,0,0,0,0,0,0,0,0,0,0,0,0,0,0,0,0,0,0,0,0,0,0,0,0,0,0,0,0,0,0,0,0,0,0,0,0,0,0,0,0,0,0,0,0,0,0,0,0,0,0,0,0,0,0,0,0,0,0,0,0,0,0,0,0,0,0,0,0,0,0,0,0,0,0,0,0,0,0,0,0,0,0,0,0,0,null,null,null,null,null,null,null,null,"Ocrotire",16,0,0,0]
[null,"Laborator biologie clinică",17,0,0,0,0,0,0,0,0,0,0,0,0,0,{"$f":"+P30-R30","v":0},0,0,{"$f":"+S30-U30","v":0},0,0,0,0,0,0,0,0,0,0,0,0,0,0,0,0,0,0,0,0,0,0,0,0,0,0,0,0,0,0,0,0,0,0,0,0,0,0,0,0,0,0,0,0,0,0,0,0,0,0,0,0,0,0,0,0,0,0,0,0,0,0,0,0,0,0,0,0,0,0,0,0,0,0,0,0,0,0,0,0,0,0,0,0,0,null,null,null,null,null,null,null,null,"Laborator biologie clinică",17,0,0,0]
[null,"Laborator anatomie patologică",18,0,0,0,0,0,0,0,0,0,0,0,0,0,0,0,0,0,0,0,0,0,0,0,0,0,0,0,0,0,0,0,0,0,0,0,0,0,0,0,0,0,0,0,0,0,0,0,0,0,0,0,0,0,0,0,0,0,0,0,0,0,0,0,0,0,0,0,0,0,0,0,0,0,0,0,0,0,0,0,0,0,0,0,0,0,0,0,0,0,0,0,0,0,0,0,0,0,0,0,0,0,0,null,null,null,null,null,null,null,null,"Laborator anatomie patologică",18,0,0,0]
[null,"Farmacie",19,0,0,0,0,0,0,0,0,0,0,0,0,0,0,0,0,0,0,0,0,0,0,0,0,0,0,0,0,0,0,0,0,0,0,0,0,0,0,0,0,0,0,0,0,0,0,0,0,0,0,0,0,0,0,0,0,0,0,0,0,0,0,0,0,0,0,0,0,0,0,0,0,0,0,0,0,0,0,0,0,0,0,0,0,0,0,0,0,0,0,0,0,0,0,0,0,0,0,0,0,0,0,null,null,null,null,null,null,null,null,"Farmacie",19,0,0,0]
[null,"Alţi asistenţi",20,0,0,0,0,0,0,0,0,0,0,0,0,0,0,0,0,0,0,0,0,0,0,0,0,0,0,0,0,0,0,0,0,0,0,0,0,0,0,0,0,0,0,0,0,0,0,0,0,0,0,0,0,0,0,0,0,0,0,0,0,0,0,0,0,0,0,0,0,0,0,0,0,0,0,0,0,0,0,0,0,0,0,0,0,0,0,0,0,0,0,0,0,0,0,0,0,0,0,0,0,0,0,null,null,null,null,null,null,null,null,"Alţi asistenţi",20,0,0,0]
["   Registratori medicali",null,21,0,0,0,0,0,0,0,0,0,0,0,0,0,0,0,0,0,0,0,0,0,0,0,0,0,0,0,0,0,0,0,0,0,0,0,0,0,0,0,0,0,0,0,0,0,0,0,0,0,0,0,0,0,0,0,0,0,0,0,0,0,0,0,0,0,0,0,0,0,0,0,0,0,0,0,0,0,0,0,0,0,0,0,0,0,0,0,0,0,0,0,0,0,0,0,0,0,0,0,0,0,0,null,null,null,null,null,null,null,"   Registratori medicali",null,21,0,0,0]
["   Statisticieni medicali",null,22,0,0,0,0,0,0,0,0,0,0,0,0,0,0,0,0,0,0,0,0,0,0,0,0,0,0,0,0,0,0,0,0,0,0,0,0,0,0,0,0,0,0,0,0,0,0,0,0,0,0,0,0,0,0,0,0,0,0,0,0,0,0,0,0,0,0,0,0,0,0,0,0,0,0,0,0,0,0,0,0,0,0,0,0,0,0,0,0,0,0,0,0,0,0,0,0,0,0,0,0,0,0,null,null,null,null,null,null,null,"   Statisticieni medicali",null,22,0,0,0]
["Tehnicieni","Dentari",23,0,0,0,0,0,0,0,0,0,0,0,0,0,0,0,0,0,0,0,0,0,0,0,0,0,0,0,0,0,0,0,0,0,0,0,0,0,0,0,0,0,0,0,0,0,0,0,0,0,0,0,0,0,0,0,0,0,0,0,0,0,0,0,0,0,0,0,0,0,0,0,0,0,0,0,0,0,0,0,0,0,0,0,0,0,0,0,0,0,0,0,0,0,0,0,0,0,0,0,0,0,0,null,null,null,null,null,null,null,"Tehnicieni","Dentari",23,0,0,0]
[null,"Opticieni",24,0,0,0,0,0,0,0,0,0,0,0,0,0,0,0,0,0,0,0,0,0,0,0,0,0,0,0,0,0,0,0,0,0,0,0,0,0,0,0,0,0,0,0,0,0,0,0,0,0,0,0,0,0,0,0,0,0,0,0,0,0,0,0,0,0,0,0,0,0,0,0,0,0,0,0,0,0,0,0,0,0,0,0,0,0,0,0,0,0,0,0,0,0,0,0,0,0,0,0,0,0,0,null,null,null,null,null,null,null,null,"Opticieni",24,0,0,0]
[null,"Utilaje medicale",25,0,0,0,0,0,0,0,0,0,0,0,0,0,0,0,0,0,0,0,0,0,0,0,0,0,0,0,0,0,0,0,0,0,0,0,0,0,0,0,0,0,0,0,0,0,0,0,0,0,0,0,0,0,0,0,0,0,0,0,0,0,0,0,0,0,0,0,0,0,0,0,0,0,0,0,0,0,0,0,0,0,0,0,0,0,0,0,0,0,0,0,0,0,0,0,0,0,0,0,0,0,0,null,null,null,null,null,null,null,null,"Utilaje medicale",25,0,0,0]
[null,"Protezare",26,0,0,0,0,0,0,0,0,0,0,0,0,0,0,0,0,0,0,0,0,0,0,0,0,0,0,0,0,0,0,0,0,0,0,0,0,0,0,0,0,0,0,0,0,0,0,0,0,0,0,0,0,0,0,0,0,0,0,0,0,0,0,0,0,0,0,0,0,0,0,0,0,0,0,0,0,0,0,0,0,0,0,0,0,0,0,0,0,0,0,0,0,0,0,0,0,0,0,0,0,0,0,null,null,null,null,null,null,null,null,"Protezare",26,0,0,0]
["Alte","Droghişti",27,0,0,0,0,0,0,0,0,0,0,0,0,0,{"$f":"+P40-R40","v":0},0,0,{"$f":"+S40-U40","v":0},0,0,0,0,0,0,0,0,0,0,0,0,0,0,0,0,0,0,0,0,0,0,0,0,0,0,0,0,0,0,0,0,0,0,0,0,0,0,0,0,0,0,0,0,0,0,0,0,0,0,0,0,0,0,0,0,0,0,0,0,0,0,0,0,0,0,0,0,0,0,0,0,0,0,0,0,0,0,0,0,0,0,0,0,0,null,null,null,null,null,null,null,"Alte","Droghişti",27,0,0,0]
[null,"Gipsari",28,0,0,0,0,0,0,0,0,0,0,0,0,0,0,0,0,0,0,0,0,0,0,0,0,0,0,0,0,0,0,0,0,0,0,0,0,0,0,0,0,0,0,0,0,0,0,0,0,0,0,0,0,0,0,0,0,0,0,0,0,0,0,0,0,0,0,0,0,0,0,0,0,0,0,0,0,0,0,0,0,0,0,0,0,0,0,0,0,0,0,0,0,0,0,0,0,0,0,0,0,0,0,null,null,null,null,null,null,null,null,"Gipsari",28,0,0,0]
[null,"Maseuri",29,0,0,0,0,0,0,0,0,0,0,0,0,0,0,0,0,0,0,0,0,0,0,0,0,0,0,0,0,0,0,0,0,0,0,0,0,0,0,0,0,0,0,0,0,0,0,0,0,0,0,0,0,0,0,0,0,0,0,0,0,0,0,0,0,0,0,0,0,0,0,0,0,0,0,0,0,0,0,0,0,0,0,0,0,0,0,0,0,0,0,0,0,0,0,0,0,0,0,0,0,0,0,null,null,null,null,null,null,null,null,"Maseuri",29,0,0,0]
[null,"Autopsieri",30,0,0,0,0,0,0,0,0,0,0,0,0,0,0,0,0,0,0,0,0,0,0,0,0,0,0,0,0,0,0,0,0,0,0,0,0,0,0,0,0,0,0,0,0,0,0,0,0,0,0,0,0,0,0,0,0,0,0,0,0,0,0,0,0,0,0,0,0,0,0,0,0,0,0,0,0,0,0,0,0,0,0,0,0,0,0,0,0,0,0,0,0,0,0,0,0,0,0,0,0,0,0,null,null,null,null,null,null,null,null,"Autopsieri",30,0,0,0]
[null,"Instructori c.f.m.",31,0,0,0,0,0,0,0,0,0,0,0,0,0,0,0,0,0,0,0,0,0,0,0,0,0,0,0,0,0,0,0,0,0,0,0,0,0,0,0,0,0,0,0,0,0,0,0,0,0,0,0,0,0,0,0,0,0,0,0,0,0,0,0,0,0,0,0,0,0,0,0,0,0,0,0,0,0,0,0,0,0,0,0,0,0,0,0,0,0,0,0,0,0,0,0,0,0,0,0,0,0,0,null,null,null,null,null,null,null,null,"Instructori c.f.m.",31,0,0,0]
[null,"Instructori educaţie",32,0,0,0,0,0,0,0,0,0,0,0,0,0,0,0,0,0,0,0,0,0,0,0,0,0,0,0,0,0,0,0,0,0,0,0,0,0,0,0,0,0,0,0,0,0,0,0,0,0,0,0,0,0,0,0,0,0,0,0,0,0,0,0,0,0,0,0,0,0,0,0,0,0,0,0,0,0,0,0,0,0,0,0,0,0,0,0,0,0,0,0,0,0,0,0,0,0,0,0,0,0,0,null,null,null,null,null,null,null,null,"Instructori educaţie",32,0,0,0]
[null,"Dentişti (studii medii)",33,0,0,0,0,0,0,0,0,0,0,0,0,0,0,0,0,0,0,0,0,0,0,0,0,0,0,0,0,0,0,0,0,0,0,0,0,0,0,0,0,0,0,0,0,0,0,0,0,0,0,0,0,0,0,0,0,0,0,0,0,0,0,0,0,0,0,0,0,0,0,0,0,0,0,0,0,0,0,0,0,0,0,0,0,0,0,0,0,0,0,0,0,0,0,0,0,0,0,0,0,0,0,null,null,null,null,null,null,null,null,"Dentişti (studii medii)",33,0,0,0]
[" TOTAL PERSONAL AUXILIAR SANITAR",null,34,0,0,0,0,0,0,0,0,0,0,0,0,0,0,0,0,0,0,0,0,0,0,0,0,0,0,0,0,0,0,0,0,0,0,0,0,0,0,0,0,0,0,0,0,0,0,0,0,0,0,0,0,0,0,0,0,0,0,0,0,0,0,0,0,0,0,0,0,0,0,0,0,0,0,0,0,0,0,0,0,0,0,0,0,0,0,0,0,0,0,0,0,0,0,0,0,0,0,0,0,0,0,null,null,null,null,null,null,null," TOTAL PERSONAL AUXILIAR SANITAR",null,34,0,0,0]
["MUNCITORI",null,35,0,0,0,0,0,0,0,0,0,0,0,0,0,0,0,0,0,0,0,0,0,0,0,0,0,0,0,0,0,0,0,0,0,0,0,0,0,0,0,0,0,0,0,0,0,0,0,0,0,0,0,0,0,0,0,0,0,0,0,0,0,0,0,0,0,0,0,0,0,0,0,0,0,0,0,0,0,0,0,0,0,0,0,0,0,0,0,0,0,0,0,0,0,0,0,0,0,0,0,0,0,0,null,null,null,null,null,null,null,"     MUNCITORI",null,35,0,0,0]
["PERSONAL DE SERVIRE",null,36,0,0,0,0,0,0,0,0,0,0,0,0,0,0,0,0,0,0,0,0,0,0,0,0,0,0,0,0,0,0,0,0,0,0,0,0,0,0,0,0,0,0,0,0,0,0,0,0,0,0,0,0,0,0,0,0,0,0,0,0,0,0,0,0,0,0,0,0,0,0,0,0,0,0,0,0,0,0,0,0,0,0,0,0,0,0,0,0,0,0,0,0,0,0,0,0,0,0,0,0,0,0,null,null,null,null,null,null,null,"     PERSONAL DE SERVIRE",null,36,0,0,0]
["PERSONAL DIN APARAT FUNCŢIONAL",null,37,0,0,0,0,0,0,0,0,0,0,0,0,0,{"$f":"+P50-R50","v":0},0,0,{"$f":"+S50-U50","v":0},0,0,0,0,0,0,0,0,0,0,0,0,0,0,0,0,0,0,0,0,0,0,0,0,0,0,0,0,0,0,0,0,0,0,0,0,0,0,0,0,0,0,0,0,0,0,0,0,0,0,0,0,0,0,0,0,0,0,0,0,0,0,0,0,0,0,0,0,0,0,0,0,0,0,0,0,0,0,0,0,0,0,0,0,0,null,null,null,null,null,null,null,"PERSONAL DIN APARAT FUNCŢIONAL",null,37,0,0,0]
[]
[]
[]
["Cap.15. PERSONAL MEDIU SANITAR, PERSONAL AUXILIAR SANITAR, MUNCITORI, PERSONAL DE SERVIRE ŞI PERSONAL DIN APARATUL FUNCŢIONAL PE GRUPE DE VÂRSTĂ"]
["B"]
["CATEGORII DE PERSONAL",null,"Randul","TOTAL",null,null,"            Repartizarea personalului sanitar mediu şi auxiliar pe grupe de vârstă",null,null,null,null,null,null,null,null,null,null,null,null,null,null,null,null,null,"Cu normă întreagă"]
[null,null,null,"TOTAL","MASCULIN","FEMININ","Sub 25 ani",null,null,"25-34 ani",null,null,"35-44 ani",null,null,"45-54 ani",null,null,"55-64 ani",null,null,"65 ani şi peste",null,null,"Total",null,null,"din care: in spital, centru de sanatate cu paturi, san. TBC, preventorii, san. de nevroze/neuropsihiatrie, san. balneare"]
[null,null,null,null,null,null,"Total","din care:",null,"Total","din care:",null,"Total","din care:",null,"Total","din care:",null,"Total","din care:",null,"Total","din care:",null,"Total","din care:",null,"Total","din care:"]
[null,null,null,null,null,null,null,"masculin","feminin",null,"masculin","feminin",null,"masculin","feminin",null,"masculin","feminin",null,"masculin","feminin",null,"masculin","feminin",null,"masculin","feminin",null,"masculin","feminin"]
["A",null,"B",1,2,3,4,5,6,7,8,9,10,11,12,13,14,15,16,17,18,19,20,21,22,23,24,25,26,27]
["TOTAL PERSONA  (rând  2+34+35+36+37)",null,1,{"$f":"+D62+SUM(D94:D97)","v":0},{"$f":"+E62+SUM(E94:E97)","v":0},0,0,0,0,{"$f":"+J62+SUM(J94:J97)","v":0},{"$f":"+K62+SUM(K94:K97)","v":0},{"$f":"+L62+SUM(L94:L97)","v":0},0,0,0,0,0,0,0,0,0,0,0,0,0,0,0,0,0,0]
["TOTAL PERSONAL MEDIU SANITAR        (rândurile  3; 21 – 33)",null,2,{"$f":"+D63+SUM(D81:D93)","v":0},0,0,0,0,0,0,0,0,0,0,0,0,0,0,0,0,0,0,0,0,0,0,0,0,0,0]
["Asistenţi, surori –  TOTAL        (rând  4 – 20)",null,3,{"$f":"SUM(D64:D80)-D75","v":0},{"$f":"SUM(E64:E80)-E75","v":0},0,0,0,0,{"$f":"SUM(J64:J80)-J75","v":0},{"$f":"SUM(K64:K80)-K75","v":0},{"$f":"SUM(L64:L80)-L75","v":0},0,0,0,0,0,0,0,0,0,0,0,0,0,0,0,0,0,0]
["După specialitate","Medicale",4,{"$f":"+E64+F64","v":0},{"$f":"+H64+K64+N64+Q64+T64+W64","v":0},{"$f":"+I64+L64+O64+R64+U64+X64","v":0},0,{"$f":"+G64-I64","v":0},0,0,{"$f":"+J64-L64","v":0},0,0,{"$f":"+M64-O64","v":0},0,0,{"$f":"+P64-R64","v":0},0,0,{"$f":"+S64-U64","v":0},0,0,{"$f":"+V64-X64","v":0},0,0,{"$f":"+Y64-AA64","v":0},0,0,{"$f":"+AB64-AD64","v":0},0,{"$f":"IF((E64>=Z64),\"OK\",\"Err\")","v":"OK"},"OK",{"$f":"IF((Z64>=AC64),\"OK\",\"Err\")","v":"OK"},"OK"]
[null,"Pediatrie",5,{"$f":"+E65+F65","v":0},{"$f":"+H65+K65+N65+Q65+T65+W65","v":0},0,0,{"$f":"+G65-I65","v":0},0,0,{"$f":"+J65-L65","v":0},0,0,{"$f":"+M65-O65","v":0},0,0,{"$f":"+P65-R65","v":0},0,0,{"$f":"+S65-U65","v":0},0,0,{"$f":"+V65-X65","v":0},0,0,{"$f":"+Y65-AA65","v":0},0,0,{"$f":"+AB65-AD65","v":0},0,"OK","OK","OK","OK"]
[null,"Obstetrică-ginecologie (moaşe)",6,0,0,0,0,0,0,0,0,0,0,0,0,0,0,0,0,0,0,0,0,0,0,0,0,0,0,0,"OK","OK","OK","OK"]
[null,"Igienă",7,0,0,0,0,0,0,0,0,0,0,0,0,0,0,0,0,0,0,0,0,0,0,0,0,0,0,0,"OK","OK","OK","OK"]
[null,"Radiologie",8,0,0,0,0,0,0,0,0,0,0,0,0,0,0,0,0,0,0,0,0,0,0,0,0,0,0,0,"OK","OK","OK","OK"]
[null,"Balneofizioterapie şi recuperare medicală",9,0,0,0,0,0,0,0,0,0,0,0,0,0,0,0,0,0,0,0,0,0,0,0,0,0,0,0,"OK","OK","OK","OK"]
[null,"Dietetică",10,0,0,0,0,0,0,0,0,0,0,0,0,0,0,0,0,0,0,0,0,0,0,0,0,0,0,0,"OK","OK","OK","OK"]
[null,"Nutriţie şi diabet",11,0,0,0,0,0,0,0,0,0,0,0,0,0,0,0,0,0,0,0,0,0,0,0,0,0,0,0,"OK","OK","OK","OK"]
[null,"Stomatologie",12,0,0,0,0,0,0,0,0,0,0,0,0,0,0,0,0,0,0,0,0,0,0,0,0,0,0,0,"OK","OK","OK","OK"]
[null,"Urgenţe medico- chirurgicale",13,0,0,0,0,0,0,0,0,0,0,0,0,0,0,0,0,0,0,0,0,0,0,0,0,0,0,0,"OK","OK","OK","OK"]
[null,"Fiziokinetoterapeuţi, din care:",14,0,0,0,0,0,0,0,0,0,0,0,0,0,0,0,0,0,0,0,0,0,0,0,0,0,0,0,"OK","OK","OK","OK"]
[null,"                                           - fizioterapeuţi",15,0,0,0,0,0,0,0,0,0,0,0,0,0,0,0,0,0,0,0,0,0,0,0,0,0,0,0,"OK","OK","OK","OK"]
[null,"Ocrotire",16,0,0,0,0,0,0,0,0,0,0,0,0,0,0,0,0,0,0,0,0,0,0,0,0,0,0,0,"OK","OK","OK","OK"]
[null,"Laborator biologie clinică",17,0,0,0,0,0,0,0,0,0,0,0,0,0,0,0,0,0,0,0,0,0,0,0,0,0,0,0,"OK","OK","OK","OK"]
[null,"Laborator anatomie patologică",18,0,0,0,0,0,0,0,0,0,0,0,0,0,0,0,0,0,0,0,0,0,0,0,0,0,0,0,"OK","OK","OK","OK"]
[null,"Farmacie",19,0,0,0,0,0,0,0,0,0,0,0,0,0,0,0,0,0,0,0,0,0,0,0,0,0,0,0,"OK","OK","OK","OK"]
[null,"Alţi asistenţi",20,0,0,0,0,0,0,0,0,0,0,0,0,0,0,0,0,0,0,0,0,0,0,0,0,0,0,0,"OK","OK","OK","OK"]
["   Registratori medicali",null,21,0,0,0,0,0,0,0,0,0,0,0,0,0,0,0,0,0,0,0,0,0,0,0,0,0,0,0,"OK","OK","OK","OK"]
["   Statisticieni medicali",null,22,0,0,0,0,0,0,0,0,0,0,0,0,0,0,0,0,0,0,0,0,0,0,0,0,0,0,0,"OK","OK","OK","OK"]
["Tehnicieni","Dentari",23,0,0,0,0,0,0,0,0,0,0,0,0,0,0,0,0,0,0,0,0,0,0,0,0,0,0,0,"OK","OK","OK","OK"]
[null,"Opticieni",24,0,0,0,0,0,0,0,0,0,0,0,0,0,0,0,0,0,0,0,0,0,0,0,0,0,0,0,"OK","OK","OK","OK"]
[null,"Utilaje medicale",25,0,0,0,0,0,0,0,0,0,0,0,0,0,0,0,0,0,0,0,0,0,0,0,0,0,0,0,"OK","OK","OK","OK"]
[null,"Protezare",26,0,0,0,0,0,0,0,0,0,0,0,0,0,0,0,0,0,0,0,0,0,0,0,0,0,0,0,"OK","OK","OK","OK"]
["Alte","Droghişti",27,0,0,0,0,0,0,0,0,0,0,0,0,0,0,0,0,0,0,0,0,0,0,0,0,0,0,0,"OK","OK","OK","OK"]
[null,"Gipsari",28,0,0,0,0,0,0,0,0,0,0,0,0,0,0,0,0,0,0,0,0,0,0,0,0,0,0,0,"OK","OK","OK","OK"]
[null,"Maseuri",29,0,0,0,0,0,0,0,0,0,0,0,0,0,0,0,0,0,0,0,0,0,0,0,0,0,0,0,"OK","OK","OK","OK"]
[null,"Autopsieri",30,0,0,0,0,0,0,0,0,0,0,0,0,0,0,0,0,0,0,0,0,0,0,0,0,0,0,0,"OK","OK","OK","OK"]
[null,"Instructori c.f.m.",31,0,0,0,0,0,0,0,0,0,0,0,0,0,0,0,0,0,0,0,0,0,0,0,0,0,0,0,"OK","OK","OK","OK"]
[null,"Instructori educaţie",32,0,0,0,0,0,0,0,0,0,0,0,0,0,0,0,0,0,0,0,0,0,0,0,0,0,0,0,"OK","OK","OK","OK"]
[null,"Dentişti (studii medii)",33,0,0,0,0,0,0,0,0,0,0,0,0,0,0,0,0,0,0,0,0,0,0,0,0,0,0,0,"OK","OK","OK","OK"]
[" TOTAL PERSONAL AUXILIAR SANITAR",null,34,0,0,0,0,0,0,0,0,0,0,0,0,0,0,0,0,0,0,0,0,0,0,0,0,0,0,0,"OK","OK","OK","OK"]
["MUNCITORI",null,35,0,0,0,0,0,0,0,0,0,0,0,0,0,0,0,0,0,0,0,0,0,0,0,0,0,0,0,"OK","OK","OK","OK"]
["PERSONAL DE SERVIRE",null,36,0,0,0,0,0,0,0,0,0,0,0,0,0,0,0,0,0,0,0,0,0,0,0,0,0,0,0,"OK","OK","OK","OK"]
["PERSONAL DIN APARAT FUNCŢIONAL",null,37,0,0,0,0,0,0,0,0,0,0,0,0,0,0,0,0,0,0,0,0,0,0,0,0,0,0,0,"OK","OK","OK","OK"]
[]
[]
[null,null,null,null,null,null,{"$f":"IF(D110=(G110),\"OK\",\"ERR\")","v":"OK"},{"$f":"IF(E110=(H110),\"OK\",\"ERR\")","v":"OK"},"OK"]
["Cap.15. PERSONAL SANITAR CU STUDII SUPERIOARE PE CATEGORII DE UNITĂŢI",null,null,null,null,null,{"$f":"IF(I110=(F194),\"OK\",\"Err\")","v":"OK"},{"$f":"IF(I167=(F252),\"OK\",\"Err\")","v":"OK"},{"$f":"IF(I171=(F256),\"OK\",\"Err\")","v":"OK"},null,null,null,null,null,null,null,null,null,null,null,null,null,null,null,null,null,null,null,null,null,null,null,null,null,null,null,null,null,null,null,null,null,null,null,null,null,null,null,null,null,null,null,null,null,null,null,null,null,null,null,null,null,null,null,null,null,null,null,null,null,null,null,null,null,null,null,null,null,null,null,null,null,null,null,null,null,null,null,null,null,null,null,null,null,null,null,null,null,null,null,null,null,null,null,null,null,null,null,null,null,null,null,null,null,null,null,"verificare intre tabelele C si D"]
["C",null,null,null,null,null,{"$f":"IF(G110=(D194),\"OK\",\"Err\")","v":"OK"},{"$f":"IF(G167=(D252),\"OK\",\"Err\")","v":"OK"},{"$f":"IF(G171=(D256),\"OK\",\"Err\")","v":"OK"}]
["CATEGORII DE PERSONAL",null,"Randul","TOTAL",null,null,"din care:",null,null,null,null,null,"            Repartizarea personalului sanitar cu studii superioare pe tipuri de unităţi",null,null,null,null,null,null,null,null,null,null,null,null,null,null,null,null,null,null,null,null,null,null,null,null,null,null,null,null,null,null,null,null,null,null,null,null,null,null,null,null,null,null,null,null,null,null,null,null,null,null,null,null,null,null,null,null,null,null,null,null,null,null,null,null,null,null,null,null,null,null,null,null,null,null,null,null,null,null,null,null,null,null,null,null,null,null,null,null,null,null,null,null,null,null,null,null,null,null,null,null,null,"UMF*)",null,"CATEGORII DE PERSONAL",null,"Randul"]
[null,null,null,"TOTAL","MASCULIN","FEMININ","Total rezi-denţi","REZIDENŢI",null,"Total  MEDICI PT.COPII","din care: MEDICI PENTRU COPII",null,"Total venit din alta tara","venit din alta tara",null,"spital",null,null,"Centru de sănătate cu paturi de spital",null,null,"Sanatorii TBC",null,null,"Preventorii",null,null,"Sanatorii balneare",null,null,"Dispensare medicale",null,null,"Cabinete medicale şcolare",null,null,"Cabinete medicale  studenţeşti",null,null,"Cabinete med.  de medicină generală ",null,null,"Cabinete medicale de familie",null,null,"Farmacii",null,null,"Puncte farmaceutice",null,null,"Depozite farmaceutice",null,null,"Policlinici",null,null,"Centre de diag. şi tratatament",null,null,"Centre medicale de specialitate",null,null,"Ambulatorii de specialitate",null,null,"Ambulatorii integrate spitalului",null,null,"Cabinete stomatologice",null,null,"Cabinete medicale de specialitate",null,null,"Centre de sănătate",null,null,"Centre de sănătate mintală",null,null,"C.T.S.",null,null,"Laboratoare medicale",null,null,"Laboratoare de tehnică dentară",null,null,"Institute, unităţi cercet. fără paturi",null,null,"MS, DSP",null,null,"Sanatorii nevroze/ neuropsihiatrie",null,null,"Salvare",null,null,"Alte tipuri de unităţi",null,null,"Societati civile medicale de familie",null,null,"Societati stomatologice civile medicale",null,null,"Societati civile medicale de specialitate",null,null,null,null,null,null,null,"TOTAL","MASCULIN","FEMININ"]
[null,null,null,null,null,null,null,"TOTAL",null,null,"TOTAL",null,null,"din care:",null,"Total","din care:",null,"Total","din care:",null,"Total","din care:",null,"Total","din care:",null,"Total","din care:",null,"Total","din care:",null,"Total","din care:",null,"Total","din care:",null,"Total","din care:",null,"Total","din care:",null,"Total","din care:",null,"Total","din care:",null,"Total","din care:",null,"Total","din care:",null,"Total","din care:",null,"Total","din care:",null,"Total","din care:",null,"Total","din care:",null,"Total","din care:",null,"Total","din care:",null,"Total","din care:",null,"Total","din care:",null,"Total","din care:",null,"Total","din care:",null,"Total","din care:",null,"Total","din care:",null,"Total","din care:",null,"Total","din care:",null,"Total","din care:",null,"Total","din care:",null,"Total","din care:",null,"Total","din care:",null,"Total","din care:"]
[null,null,null,null,null,null,null,"masculin","feminin",null,"masculin","feminin",null,"masculin","feminin",null,"masculin","feminin",null,"masculin","feminin",null,"masculin","feminin",null,"masculin","feminin",null,"masculin","feminin",null,"masculin","feminin",null,"masculin","feminin",null,"masculin","feminin",null,"masculin","feminin",null,"masculin","feminin",null,"masculin","feminin",null,"masculin","feminin",null,"masculin","feminin",null,"masculin","feminin",null,"masculin","feminin",null,"masculin","feminin",null,"masculin","feminin",null,"masculin","feminin",null,"masculin","feminin",null,"masculin","feminin",null,"masculin","feminin",null,"masculin","feminin",null,"masculin","feminin",null,"masculin","feminin",null,"masculin","feminin",null,"masculin","feminin",null,"masculin","feminin",null,"masculin","feminin",null,"masculin","feminin",null,"masculin","feminin",null,"masculin","feminin",null,"masculin","feminin",null,"masculin","feminin"]
["A",null,"B",1,2,3,4,5,6,7,8,9,10,11,12,13,14,15,16,17,18,19,20,21,22,23,24,25,26,27,28,29,30,31,32,33,34,35,36,37,38,39,40,41,42,43,44,45,46,47,48,49,50,51,52,53,54,55,56,57,58,59,60,61,62,63,64,65,66,67,68,69,70,71,72,73,74,75,76,77,78,79,80,81,82,83,84,85,86,87,88,89,90,91,92,93,94,95,96,97,98,99,100,101,102,103,104,105,106,107,108,109,110,111,112,null,"A",null,"B",1,2,3]
["TOTAL PERSONAL CU STUDII SUPERIOARE (rândurile  2+59+63+67+69+71+72)",null,1,{"$f":"+E108+F108","v":0},{"$f":"+E109+E166+E170+E174+E176+E178+E180","v":0},{"$f":"+F109+F166+F170+F174+F176+F178+F180","v":0},{"$f":"+G109+G166+G170","v":0},{"$f":"+H109+H166+H170","v":0},{"$f":"+I109+I166+I170","v":0},{"$f":"+J109+J166+J170+J174+J176+J178+J180","v":0},0,0,0,0,0,{"$f":"+P109+P166+P170+P174+P176+P178+P180","v":0},0,0,0,0,0,0,0,0,0,0,0,0,0,0,0,0,0,0,0,0,0,0,0,0,0,0,0,0,0,0,0,0,0,0,0,0,0,0,0,0,0,0,0,0,0,0,0,0,0,0,0,0,0,0,0,0,0,{"$f":"+BV109+BV166+BV170+BV174+BV176+BV178+BV180","v":0},0,0,0,0,0,0,0,0,0,0,0,0,0,0,0,0,0,0,0,0,0,0,0,0,0,0,0,0,0,0,0,{"$f":"+DB109+DB166+DB170+DB174+DB176+DB178+DB180","v":0},0,0,0,0,0,0,0,0,{"$f":"+DK109+DK166+DK170+DK174+DK176+DK178+DK180","v":0},null,"TOTAL PERSONAL CU STUDII SUPERIOARE (rândurile 02+57+61+65+67+69+70)",null,1,{"$f":"+D192-D108","v":0},{"$f":"+E192-E108","v":0},{"$f":"+F192-F108","v":0}]
["I. MEDICI (EXCLUSIV DENTIŞTI) – TOTAL     (rândurile  4+......+58),                   din care:",null,2,{"$f":"SUM(D111:D165)","v":0},{"$f":"SUM(E111:E165)","v":0},0,0,0,0,0,0,0,0,0,0,0,0,0,0,0,0,0,0,0,0,0,0,0,0,0,0,0,0,0,0,0,0,0,0,0,0,0,0,0,0,0,0,0,0,0,0,0,0,0,0,0,0,0,0,0,0,0,0,0,0,0,0,0,{"$f":"SUM(BQ111:BQ165)","v":0},0,0,0,0,0,0,0,0,0,0,0,0,0,0,0,0,0,0,0,0,0,0,0,0,0,0,0,0,0,0,0,0,0,0,0,0,{"$f":"SUM(DB111:DB165)","v":0},0,0,0,0,0,0,0,0,{"$f":"SUM(DK111:DK165)","v":0},null,"I. MEDICI (EXCLUSIV DENTIŞTI) – TOTAL     (rândurile 04+......+56)                   din care:",null,2,0,0,0]
["                    - rezidenţi ",null,3,{"$f":"+E110+F110","v":0},{"$f":"+Q110+T110+W110+Z110+AC110+AF110+AI110+AL110+AO110+AR110+AU110+AX110+BA110+BD110+BG110+BJ110+BM110+BP110+BS110+BV110+BY110+CB110+CE110+CH110+CK110+CN110+CQ110+CT110+CW110+CZ110","v":0},{"$f":"R110+U110+X110+AA110+AD110+AG110+AJ110+AM110+AP110+AS110+AV110+AY110+BB110+BE110+BH110+BK110+BN110+BQ110+BT110+BW110+BZ110+CC110+CF110+CI110+CL110+CO110+CR110+CU110+CX110+DA110","v":0},{"$f":"SUM(G111:G165)","v":0},{"$f":"+G110-I110","v":0},{"$f":"SUM(I111:I165)","v":0},0,{"$f":"+J110-L110","v":0},0,0,{"$f":"+M110-O110","v":0},0,0,{"$f":"+P110-R110","v":0},0,0,{"$f":"+S110-U110","v":0},0,0,{"$f":"+V110-X110","v":0},0,0,{"$f":"+Y110-AA110","v":0},0,0,{"$f":"+AB110-AD110","v":0},0,0,{"$f":"+AE110-AG110","v":0},0,0,{"$f":"+AH110-AJ110","v":0},0,0,{"$f":"+AK110-AM110","v":0},0,0,{"$f":"+AN110-AP110","v":0},0,0,{"$f":"+AQ110-AS110","v":0},0,0,{"$f":"+AT110-AV110","v":0},0,0,{"$f":"+AW110-AY110","v":0},0,0,{"$f":"+AZ110-BB110","v":0},0,0,{"$f":"+BC110-BE110","v":0},0,0,{"$f":"+BF110-BH110","v":0},0,0,{"$f":"+BI110-BK110","v":0},0,0,{"$f":"+BL110-BN110","v":0},0,0,{"$f":"+BO110-BQ110","v":0},0,0,{"$f":"+BR110-BT110","v":0},0,0,{"$f":"+BU110-BW110","v":0},0,0,{"$f":"+BX110-BZ110","v":0},0,0,{"$f":"+CA110-CC110","v":0},0,0,{"$f":"+CD110-CF110","v":0},0,0,{"$f":"+CG110-CI110","v":0},0,0,{"$f":"+CJ110-CL110","v":0},0,0,{"$f":"+CM110-CO110","v":0},0,0,{"$f":"+CP110-CR110","v":0},0,0,{"$f":"+CS110-CU110","v":0},0,0,{"$f":"+CV110-CX110","v":0},0,0,{"$f":"+CY110-DA110","v":0},0,0,{"$f":"+DB110-DD110","v":0},0,0,{"$f":"+DE110-DG110","v":0},0,0,{"$f":"+DH110-DJ110","v":0},0,0,null,"                    - rezidenţi ",null,3,0,0,0]
["1. Alergologie şi imunologie clinică",null,4,{"$f":"+E111+F111","v":0},{"$f":"+Q111+T111+W111+Z111+AC111+AF111+AI111+AL111+AO111+AR111+AU111+AX111+BA111+BD111+BG111+BJ111+BM111+BP111+BS111+BV111+BY111+CB111+CE111+CH111+CK111+CN111+CQ111+CT111+CW111+CZ111","v":0},{"$f":"R111+U111+X111+AA111+AD111+AG111+AJ111+AM111+AP111+AS111+AV111+AY111+BB111+BE111+BH111+BK111+BN111+BQ111+BT111+BW111+BZ111+CC111+CF111+CI111+CL111+CO111+CR111+CU111+CX111+DA111","v":0},0,{"$f":"+G111-I111","v":0},0,0,{"$f":"+J111-L111","v":0},0,0,{"$f":"+M111-O111","v":0},0,0,{"$f":"+P111-R111","v":0},0,0,{"$f":"+S111-U111","v":0},0,0,{"$f":"+V111-X111","v":0},0,0,{"$f":"+Y111-AA111","v":0},0,0,{"$f":"+AB111-AD111","v":0},0,0,{"$f":"+AE111-AG111","v":0},0,0,{"$f":"+AH111-AJ111","v":0},0,0,{"$f":"+AK111-AM111","v":0},0,0,{"$f":"+AN111-AP111","v":0},0,0,{"$f":"+AQ111-AS111","v":0},0,0,{"$f":"+AT111-AV111","v":0},0,0,{"$f":"+AW111-AY111","v":0},0,0,{"$f":"+AZ111-BB111","v":0},0,0,{"$f":"+BC111-BE111","v":0},0,0,{"$f":"+BF111-BH111","v":0},0,0,{"$f":"+BI111-BK111","v":0},0,0,{"$f":"+BL111-BN111","v":0},0,0,{"$f":"+BO111-BQ111","v":0},0,0,{"$f":"+BR111-BT111","v":0},0,0,{"$f":"+BU111-BW111","v":0},0,0,{"$f":"+BX111-BZ111","v":0},0,0,{"$f":"+CA111-CC111","v":0},0,0,{"$f":"+CD111-CF111","v":0},0,0,{"$f":"+CG111-CI111","v":0},0,0,{"$f":"+CJ111-CL111","v":0},0,0,{"$f":"+CM111-CO111","v":0},0,0,{"$f":"+CP111-CR111","v":0},0,0,{"$f":"+CS111-CU111","v":0},0,0,{"$f":"+CV111-CX111","v":0},0,0,{"$f":"+CY111-DA111","v":0},0,0,{"$f":"+DB111-DD111","v":0},0,0,{"$f":"+DE111-DG111","v":0},0,0,{"$f":"+DH111-DJ111","v":0},0,0,null,"1. Alergologie şi imunologie clinică",null,4,0,0,0]
["2. A.T.I.",null,5,0,0,0,0,0,0,0,{"$f":"+J112-L112","v":0},0,0,0,0,0,{"$f":"+P112-R112","v":0},0,0,{"$f":"+S112-U112","v":0},0,0,{"$f":"+V112-X112","v":0},0,0,{"$f":"+Y112-AA112","v":0},0,0,{"$f":"+AB112-AD112","v":0},0,0,{"$f":"+AE112-AG112","v":0},0,0,{"$f":"+AH112-AJ112","v":0},0,0,{"$f":"+AK112-AM112","v":0},0,0,{"$f":"+AN112-AP112","v":0},0,0,{"$f":"+AQ112-AS112","v":0},0,0,{"$f":"+AT112-AV112","v":0},0,0,{"$f":"+AW112-AY112","v":0},0,0,{"$f":"+AZ112-BB112","v":0},0,0,{"$f":"+BC112-BE112","v":0},0,0,{"$f":"+BF112-BH112","v":0},0,0,{"$f":"+BI112-BK112","v":0},0,0,{"$f":"+BL112-BN112","v":0},0,0,{"$f":"+BO112-BQ112","v":0},0,0,{"$f":"+BR112-BT112","v":0},0,0,{"$f":"+BU112-BW112","v":0},0,0,{"$f":"+BX112-BZ112","v":0},0,0,{"$f":"+CA112-CC112","v":0},0,0,{"$f":"+CD112-CF112","v":0},0,0,{"$f":"+CG112-CI112","v":0},0,0,{"$f":"+CJ112-CL112","v":0},0,0,{"$f":"+CM112-CO112","v":0},0,0,{"$f":"+CP112-CR112","v":0},0,0,{"$f":"+CS112-CU112","v":0},0,0,{"$f":"+CV112-CX112","v":0},0,0,{"$f":"+CY112-DA112","v":0},0,0,{"$f":"+DB112-DD112","v":0},0,0,{"$f":"+DE112-DG112","v":0},0,0,{"$f":"+DH112-DJ112","v":0},0,0,null,"2. A.T.I.",null,5,0,0,0]
["3. Boli infecţioase",null,6,0,0,0,0,0,0,0,0,0,0,0,0,0,{"$f":"+P113-R113","v":0},0,0,{"$f":"+S113-U113","v":0},0,0,{"$f":"+V113-X113","v":0},0,0,{"$f":"+Y113-AA113","v":0},0,0,{"$f":"+AB113-AD113","v":0},0,0,{"$f":"+AE113-AG113","v":0},0,0,{"$f":"+AH113-AJ113","v":0},0,0,{"$f":"+AK113-AM113","v":0},0,0,{"$f":"+AN113-AP113","v":0},0,0,{"$f":"+AQ113-AS113","v":0},0,0,{"$f":"+AT113-AV113","v":0},0,0,{"$f":"+AW113-AY113","v":0},0,0,{"$f":"+AZ113-BB113","v":0},0,0,{"$f":"+BC113-BE113","v":0},0,0,{"$f":"+BF113-BH113","v":0},0,0,{"$f":"+BI113-BK113","v":0},0,0,{"$f":"+BL113-BN113","v":0},0,0,{"$f":"+BO113-BQ113","v":0},0,0,{"$f":"+BR113-BT113","v":0},0,0,{"$f":"+BU113-BW113","v":0},0,0,{"$f":"+BX113-BZ113","v":0},0,0,{"$f":"+CA113-CC113","v":0},0,0,{"$f":"+CD113-CF113","v":0},0,0,{"$f":"+CG113-CI113","v":0},0,0,{"$f":"+CJ113-CL113","v":0},0,0,{"$f":"+CM113-CO113","v":0},0,0,{"$f":"+CP113-CR113","v":0},0,0,{"$f":"+CS113-CU113","v":0},0,0,{"$f":"+CV113-CX113","v":0},0,0,{"$f":"+CY113-DA113","v":0},0,0,{"$f":"+DB113-DD113","v":0},0,0,{"$f":"+DE113-DG113","v":0},0,0,{"$f":"+DH113-DJ113","v":0},0,0,null,"3. Boli infecţioase",null,6,0,0,0]
["4. Cardiologie",null,7,0,0,0,0,0,0,0,0,0,0,0,0,0,{"$f":"+P114-R114","v":0},0,0,{"$f":"+S114-U114","v":0},0,0,{"$f":"+V114-X114","v":0},0,0,{"$f":"+Y114-AA114","v":0},0,0,{"$f":"+AB114-AD114","v":0},0,0,{"$f":"+AE114-AG114","v":0},0,0,{"$f":"+AH114-AJ114","v":0},0,0,{"$f":"+AK114-AM114","v":0},0,0,{"$f":"+AN114-AP114","v":0},0,0,{"$f":"+AQ114-AS114","v":0},0,0,{"$f":"+AT114-AV114","v":0},0,0,{"$f":"+AW114-AY114","v":0},0,0,{"$f":"+AZ114-BB114","v":0},0,0,{"$f":"+BC114-BE114","v":0},0,0,{"$f":"+BF114-BH114","v":0},0,0,{"$f":"+BI114-BK114","v":0},0,0,{"$f":"+BL114-BN114","v":0},0,0,{"$f":"+BO114-BQ114","v":0},0,0,{"$f":"+BR114-BT114","v":0},0,0,{"$f":"+BU114-BW114","v":0},0,0,{"$f":"+BX114-BZ114","v":0},0,0,{"$f":"+CA114-CC114","v":0},0,0,{"$f":"+CD114-CF114","v":0},0,0,{"$f":"+CG114-CI114","v":0},0,0,{"$f":"+CJ114-CL114","v":0},0,0,{"$f":"+CM114-CO114","v":0},0,0,{"$f":"+CP114-CR114","v":0},0,0,{"$f":"+CS114-CU114","v":0},0,0,{"$f":"+CV114-CX114","v":0},0,0,{"$f":"+CY114-DA114","v":0},0,0,{"$f":"+DB114-DD114","v":0},0,0,{"$f":"+DE114-DG114","v":0},0,0,{"$f":"+DH114-DJ114","v":0},0,0,null,"4. Cardiologie",null,7,0,0,0]
["5. Dermatovenerologie",null,8,0,0,0,0,0,0,0,0,0,0,0,0,0,0,0,0,0,0,0,0,0,0,0,0,0,0,0,0,0,0,0,0,0,0,0,0,0,0,0,0,0,0,0,0,0,0,0,0,0,0,0,0,0,0,0,0,0,0,0,0,0,0,0,0,0,0,0,0,0,0,0,0,0,0,0,0,0,0,0,0,0,0,0,0,0,0,0,0,0,0,0,0,0,0,0,0,0,0,0,0,0,0,0,0,0,0,0,0,0,0,0,0,null,"5. Dermatovenerologie",null,8,0,0,0]
["6. Diabet zaharat, nutriţie şi boli metabolice",null,9,0,0,0,0,0,0,0,0,0,0,0,0,0,0,0,0,0,0,0,0,0,0,0,0,0,0,0,0,0,0,0,0,0,0,0,0,0,0,0,0,0,0,0,0,0,0,0,0,0,0,0,0,0,0,0,0,0,0,0,0,0,0,0,0,0,0,0,0,0,0,0,0,0,0,0,0,0,0,0,0,0,0,0,0,0,0,0,0,0,0,0,0,0,0,0,0,0,0,0,0,0,0,0,0,0,0,0,0,0,0,0,0,null,"6. Diabet zaharat, nutriţie şi boli metabolice",null,9,0,0,0]
["7. Endocrinologie",null,10,0,0,0,0,0,0,0,0,0,0,0,0,0,0,0,0,0,0,0,0,0,0,0,0,0,0,0,0,0,0,0,0,0,0,0,0,0,0,0,0,0,0,0,0,0,0,0,0,0,0,0,0,0,0,0,0,0,0,0,0,0,0,0,0,0,0,0,0,0,0,0,0,0,0,0,0,0,0,0,0,0,0,0,0,0,0,0,0,0,0,0,0,0,0,0,0,0,0,0,0,0,0,0,0,0,0,0,0,0,0,0,0,null,"7. Endocrinologie",null,10,0,0,0]
["8. Expertiza medicală a capacităţii de muncă",null,11,0,0,0,0,0,0,0,0,0,0,0,0,0,0,0,0,0,0,0,0,0,0,0,0,0,0,0,0,0,0,0,0,0,0,0,0,0,0,0,0,0,0,0,0,0,0,0,0,0,0,0,0,0,0,0,0,0,0,0,0,0,0,0,0,0,0,0,0,0,0,0,0,0,0,0,0,0,0,0,0,0,0,0,0,0,0,0,0,0,0,0,0,0,0,0,0,0,0,0,0,0,0,0,0,0,0,0,0,0,0,0,0,null,"8. Expertiza medicală a capacităţii de muncă",null,11,0,0,0]
["9. Farmacologie clinică",null,12,0,0,0,0,0,0,0,0,0,0,0,0,0,0,0,0,0,0,0,0,0,0,0,0,0,0,0,0,0,0,0,0,0,0,0,0,0,0,0,0,0,0,0,0,0,0,0,0,0,0,0,0,0,0,0,0,0,0,0,0,0,0,0,0,0,0,0,0,0,0,0,0,0,0,0,0,0,0,0,0,0,0,0,0,0,0,0,0,0,0,0,0,0,0,0,0,0,0,0,0,0,0,0,0,0,0,0,0,0,0,0,0,null,"9. Farmacologie clinică",null,12,0,0,0]
["10. Gastroenterologie",null,13,0,0,0,0,0,0,0,0,0,0,0,0,0,0,0,0,0,0,0,0,0,0,0,0,0,0,0,0,0,0,0,0,0,0,0,0,0,0,0,0,0,0,0,0,0,0,0,0,0,0,0,0,0,0,0,0,0,0,0,0,0,0,0,0,0,0,0,0,0,0,0,0,0,0,0,0,0,0,0,0,0,0,0,0,0,0,0,0,0,0,0,0,0,0,0,0,0,0,0,0,0,0,0,0,0,0,0,0,0,0,0,0,null,"10. Gastroenterologie",null,13,0,0,0]
["11. Genetică medicală",null,14,0,0,0,0,0,0,0,0,0,0,0,0,0,0,0,0,0,0,0,0,0,0,0,0,0,0,0,0,0,0,0,0,0,0,0,0,0,0,0,0,0,0,0,0,0,0,0,0,0,0,0,0,0,0,0,0,0,0,0,0,0,0,0,0,0,0,0,0,0,0,0,0,0,0,0,0,0,0,0,0,0,0,0,0,0,0,0,0,0,0,0,0,0,0,0,0,0,0,0,0,0,0,0,0,0,0,0,0,0,0,0,0,null,"11. Genetică medicală",null,14,0,0,0]
["12. Geriatrie şi gerontologie",null,15,0,0,0,0,0,0,0,0,0,0,0,0,0,0,0,0,0,0,0,0,0,0,0,0,0,0,0,0,0,0,0,0,0,0,0,0,0,0,0,0,0,0,0,0,0,0,0,0,0,0,0,0,0,0,0,0,0,0,0,0,0,0,0,0,0,0,0,0,0,0,0,0,0,0,0,0,0,0,0,0,0,0,0,0,0,0,0,0,0,0,0,0,0,0,0,0,0,0,0,0,0,0,0,0,0,0,0,0,0,0,0,0,null,"12. Geriatrie şi gerontologie",null,15,0,0,0]
["13. Hematologie",null,16,0,0,0,0,0,0,0,0,0,0,0,0,0,0,0,0,0,0,0,0,0,0,0,0,0,0,0,0,0,0,0,0,0,0,0,0,0,0,0,0,0,0,0,0,0,0,0,0,0,0,0,0,0,0,0,0,0,0,0,0,0,0,0,0,0,0,0,0,0,0,0,0,0,0,0,0,0,0,0,0,0,0,0,0,0,0,0,0,0,0,0,0,0,0,0,0,0,0,0,0,0,0,0,0,0,0,0,0,0,0,0,0,null,"13. Hematologie",null,16,0,0,0]
["14. Medicină de familie",null,17,0,0,0,0,0,0,0,0,0,0,0,0,0,0,0,0,0,0,0,0,0,0,0,0,0,0,0,0,0,0,0,0,0,0,0,0,0,0,0,0,0,0,0,0,0,0,0,0,0,0,0,0,0,0,0,0,0,0,0,0,0,0,0,0,0,0,0,0,0,0,0,0,0,0,0,0,0,0,0,0,0,0,0,0,0,0,0,0,0,0,0,0,0,0,0,0,0,0,0,0,0,0,0,0,0,0,0,0,0,0,0,0,null,"14. Medicină de familie",null,17,0,0,0]
["15. Medicină de urgenţă",null,18,0,0,0,0,0,0,0,0,0,0,0,0,0,0,0,0,0,0,0,0,0,0,0,0,0,0,0,0,0,0,0,0,0,0,0,0,0,0,0,0,0,0,0,0,0,0,0,0,0,0,0,0,0,0,0,0,0,0,0,0,0,0,0,0,0,0,0,0,0,0,0,0,0,0,0,0,0,0,0,0,0,0,0,0,0,0,0,0,0,0,0,0,0,0,0,0,0,0,0,0,0,0,0,0,0,0,0,0,0,0,0,0,null,"15. Medicină de urgenţă",null,18,0,0,0]
["16. Medicină internă",null,19,0,0,0,0,0,0,0,0,0,0,0,0,0,0,0,0,0,0,0,0,0,0,0,0,0,0,0,0,0,0,0,0,0,0,0,0,0,0,0,0,0,0,0,0,0,0,0,0,0,0,0,0,0,0,0,0,0,0,0,0,0,0,0,0,0,0,0,0,0,0,0,0,0,0,0,0,0,0,0,0,0,0,0,0,0,0,0,0,0,0,0,0,0,0,0,0,0,0,0,0,0,0,0,0,0,0,0,0,0,0,0,0,null,"16. Medicină internă",null,19,0,0,0]
["17. Medicină generală",null,20,0,0,0,0,0,0,0,0,0,0,0,0,0,0,0,0,0,0,0,0,0,0,0,0,0,0,0,0,0,0,0,0,0,0,0,0,0,0,0,0,0,0,0,0,0,0,0,0,0,0,0,0,0,0,0,0,0,0,0,0,0,0,0,0,0,0,0,0,0,0,0,0,0,0,0,0,0,0,0,0,0,0,0,0,0,0,0,0,0,0,0,0,0,0,0,0,0,0,0,0,0,0,0,0,0,0,0,0,0,0,0,0,null,"17. Medicină generală",null,20,0,0,0]
["18. Medicina muncii",null,21,0,0,0,0,0,0,0,0,0,0,0,0,0,0,0,0,0,0,0,0,0,0,0,0,0,0,0,0,0,0,0,0,0,0,0,0,0,0,0,0,0,0,0,0,0,0,0,0,0,0,0,0,0,0,0,0,0,0,0,0,0,0,0,0,0,0,0,0,0,0,0,0,0,0,0,0,0,0,0,0,0,0,0,0,0,0,0,0,0,0,0,0,0,0,0,0,0,0,0,0,0,0,0,0,0,0,0,0,0,0,0,0,null,"18. Medicina muncii",null,21,0,0,0]
["19. Medicină sportivă",null,22,0,0,0,0,0,0,0,0,0,0,0,0,0,0,0,0,0,0,0,0,0,0,0,0,0,0,0,0,0,0,0,0,0,0,0,0,0,0,0,0,0,0,0,0,0,0,0,0,0,0,0,0,0,0,0,0,0,0,0,0,0,0,0,0,0,0,0,0,0,0,0,0,0,0,0,0,0,0,0,0,0,0,0,0,0,0,0,0,0,0,0,0,0,0,0,0,0,0,0,0,0,0,0,0,0,0,0,0,0,0,0,0,null,"19. Medicină sportivă",null,22,0,0,0]
["20. Nefrologie",null,23,0,0,0,0,0,0,0,0,0,0,0,0,0,0,0,0,0,0,0,0,0,0,0,0,0,0,0,0,0,0,0,0,0,0,0,0,0,0,0,0,0,0,0,0,0,0,0,0,0,0,0,0,0,0,0,0,0,0,0,0,0,0,0,0,0,0,0,0,0,0,0,0,0,0,0,0,0,0,0,0,0,0,0,0,0,0,0,0,0,0,0,0,0,0,0,0,0,0,0,0,0,0,0,0,0,0,0,0,0,0,0,0,null,"20. Nefrologie",null,23,0,0,0]
["21. Neonatologie",null,24,0,0,0,0,0,0,0,0,0,0,0,0,0,0,0,0,0,0,0,0,0,0,0,0,0,0,0,0,0,0,0,0,0,0,0,0,0,0,0,0,0,0,0,0,0,0,0,0,0,0,0,0,0,0,0,0,0,0,0,0,0,0,0,0,0,0,0,0,0,0,0,0,0,0,0,0,0,0,0,0,0,0,0,0,0,0,0,0,0,0,0,0,0,0,0,0,0,0,0,0,0,0,0,0,0,0,0,0,0,0,0,0,null,"21. Neonatologie",null,24,0,0,0]
["22. Neurologie",null,25,0,0,0,0,0,0,0,0,0,0,0,0,0,0,0,0,0,0,0,0,0,0,0,0,0,0,0,0,0,0,0,0,0,0,0,0,0,0,0,0,0,0,0,0,0,0,0,0,0,0,0,0,0,0,0,0,0,0,0,0,0,0,0,0,0,0,0,0,0,0,0,0,0,0,0,0,0,0,0,0,0,0,0,0,0,0,0,0,0,0,0,0,0,0,0,0,0,0,0,0,0,0,0,0,0,0,0,0,0,0,0,0,null,"22. Neurologie",null,25,0,0,0]
["23. Neurologie pediatrică",null,26,0,0,0,0,0,0,0,0,0,0,0,0,0,0,0,0,0,0,0,0,0,0,0,0,0,0,0,0,0,0,0,0,0,0,0,0,0,0,0,0,0,0,0,0,0,0,0,0,0,0,0,0,0,0,0,0,0,0,0,0,0,0,0,0,0,0,0,0,0,0,0,0,0,0,0,0,0,0,0,0,0,0,0,0,0,0,0,0,0,0,0,0,0,0,0,0,0,0,0,0,0,0,0,0,0,0,0,0,0,0,0,0,null,"23. Neurologie pediatrică",null,26,0,0,0]
["24. Oncologie medicală",null,27,0,0,0,0,0,0,0,0,0,0,0,0,0,0,0,0,0,0,0,0,0,0,0,0,0,0,0,0,0,0,0,0,0,0,0,0,0,0,0,0,0,0,0,0,0,0,0,0,0,0,0,0,0,0,0,0,0,0,0,0,0,0,0,0,0,0,0,0,0,0,0,0,0,0,0,0,0,0,0,0,0,0,0,0,0,0,0,0,0,0,0,0,0,0,0,0,0,0,0,0,0,0,0,0,0,0,0,0,0,0,0,0,null,"24. Oncologie medicală",null,27,0,0,0]
["25. Pediatrie",null,28,0,0,0,0,0,0,0,0,0,0,0,0,0,0,0,0,0,0,0,0,0,0,0,0,0,0,0,0,0,0,0,0,0,0,0,0,0,0,0,0,0,0,0,0,0,0,0,0,0,0,0,0,0,0,0,0,0,0,0,0,0,0,0,0,0,0,0,0,0,0,0,0,0,0,0,0,0,0,0,0,0,0,0,0,0,0,0,0,0,0,0,0,0,0,0,0,0,0,0,0,0,0,0,0,0,0,0,0,0,0,0,0,null,"25. Pediatrie",null,28,0,0,0]
["26. Pneumologie",null,29,0,0,0,0,0,0,0,0,0,0,0,0,0,0,0,0,0,0,0,0,0,0,0,0,0,0,0,0,0,0,0,0,0,0,0,0,0,0,0,0,0,0,0,0,0,0,0,0,0,0,0,0,0,0,0,0,0,0,0,0,0,0,0,0,0,0,0,0,0,0,0,0,0,0,0,0,0,0,0,0,0,0,0,0,0,0,0,0,0,0,0,0,0,0,0,0,0,0,0,0,0,0,0,0,0,0,0,0,0,0,0,0,null,"26. Pneumologie",null,29,0,0,0]
["27. Psihiatrie ",null,30,0,0,0,0,0,0,0,0,0,0,0,0,0,0,0,0,0,0,0,0,0,0,0,0,0,0,0,0,0,0,0,0,0,0,0,0,0,0,0,0,0,0,0,0,0,0,0,0,0,0,0,0,0,0,0,0,0,0,0,0,0,0,0,0,0,0,0,0,0,0,0,0,0,0,0,0,0,0,0,0,0,0,0,0,0,0,0,0,0,0,0,0,0,0,0,0,0,0,0,0,0,0,0,0,0,0,0,0,0,0,0,0,null,"27. Psihiatrie ",null,30,0,0,0]
["28. Psihiatrie pediatrică ",null,31,0,0,0,0,0,0,0,0,0,0,0,0,0,0,0,0,0,0,0,0,0,0,0,0,0,0,0,0,0,0,0,0,0,0,0,0,0,0,0,0,0,0,0,0,0,0,0,0,0,0,0,0,0,0,0,0,0,0,0,0,0,0,0,0,0,0,0,0,0,0,0,0,0,0,0,0,0,0,0,0,0,0,0,0,0,0,0,0,0,0,0,0,0,0,0,0,0,0,0,0,0,0,0,0,0,0,0,0,0,0,0,0,null,"28. Psihiatrie pediatrică ",null,31,0,0,0]
["29. Radioterapie",null,32,0,0,0,0,0,0,0,0,0,0,0,0,0,0,0,0,0,0,0,0,0,0,0,0,0,0,0,0,0,0,0,0,0,0,0,0,0,0,0,0,0,0,0,0,0,0,0,0,0,0,0,0,0,0,0,0,0,0,0,0,0,0,0,0,0,0,0,0,0,0,0,0,0,0,0,0,0,0,0,0,0,0,0,0,0,0,0,0,0,0,0,0,0,0,0,0,0,0,0,0,0,0,0,0,0,0,0,0,0,0,0,0,null,"29. Radioterapie",null,32,0,0,0]
["30. Recuperare, medicină fizică şi balneologie",null,33,0,0,0,0,0,0,0,0,0,0,0,0,0,0,0,0,0,0,0,0,0,0,0,0,0,0,0,0,0,0,0,0,0,0,0,0,0,0,0,0,0,0,0,0,0,0,0,0,0,0,0,0,0,0,0,0,0,0,0,0,0,0,0,0,0,0,0,0,0,0,0,0,0,0,0,0,0,0,0,0,0,0,0,0,0,0,0,0,0,0,0,0,0,0,0,0,0,0,0,0,0,0,0,0,0,0,0,0,0,0,0,0,null,"30. Recuperare, medicină fizică şi balneologie",null,33,{"$f":"+D224-D140","v":0},{"$f":"+E224-E140","v":0},{"$f":"+F224-F140","v":0}]
["31.Reabilitare medicală",null,34,{"$f":"+E141+F141","v":0},{"$f":"+Q141+T141+W141+Z141+AC141+AF141+AI141+AL141+AO141+AR141+AU141+AX141+BA141+BD141+BG141+BJ141+BM141+BP141+BS141+BV141+BY141+CB141+CE141+CH141+CK141+CN141+CQ141+CT141+CW141+CZ141","v":0},{"$f":"R141+U141+X141+AA141+AD141+AG141+AJ141+AM141+AP141+AS141+AV141+AY141+BB141+BE141+BH141+BK141+BN141+BQ141+BT141+BW141+BZ141+CC141+CF141+CI141+CL141+CO141+CR141+CU141+CX141+DA141","v":0},0,{"$f":"+G141-I141","v":0},0,0,{"$f":"+J141-L141","v":0},0,0,{"$f":"+M141-O141","v":0},0,0,{"$f":"+P141-R141","v":0},0,0,{"$f":"+S141-U141","v":0},0,0,{"$f":"+V141-X141","v":0},0,0,{"$f":"+Y141-AA141","v":0},0,0,{"$f":"+AB141-AD141","v":0},0,0,{"$f":"+AE141-AG141","v":0},0,0,{"$f":"+AH141-AJ141","v":0},0,0,{"$f":"+AK141-AM141","v":0},0,0,{"$f":"+AN141-AP141","v":0},0,0,{"$f":"+AQ141-AS141","v":0},0,0,{"$f":"+AT141-AV141","v":0},0,0,{"$f":"+AW141-AY141","v":0},0,0,{"$f":"+AZ141-BB141","v":0},0,0,{"$f":"+BC141-BE141","v":0},0,0,{"$f":"+BF141-BH141","v":0},0,0,{"$f":"+BI141-BK141","v":0},0,0,{"$f":"+BL141-BN141","v":0},0,0,{"$f":"+BO141-BQ141","v":0},0,0,{"$f":"+BR141-BT141","v":0},0,0,{"$f":"+BU141-BW141","v":0},0,0,{"$f":"+BX141-BZ141","v":0},0,0,{"$f":"+CA141-CC141","v":0},0,0,{"$f":"+CD141-CF141","v":0},0,0,{"$f":"+CG141-CI141","v":0},0,0,{"$f":"+CJ141-CL141","v":0},0,0,{"$f":"+CM141-CO141","v":0},0,0,{"$f":"+CP141-CR141","v":0},0,0,{"$f":"+CS141-CU141","v":0},0,0,{"$f":"+CV141-CX141","v":0},0,0,{"$f":"+CY141-DA141","v":0},0,0,0,0,0,0,0,0,0,0,0,null,"31.Reabilitare medicală",null,34,0,0,0]
["32.Reumatologie",null,35,0,0,0,0,0,0,0,0,0,0,0,0,0,0,0,0,0,0,0,0,0,0,0,0,0,0,0,0,0,0,0,0,0,0,0,0,0,0,0,0,0,0,0,0,0,0,0,0,0,0,0,0,0,0,0,0,0,0,0,0,0,0,0,0,0,0,0,0,0,0,0,0,0,0,0,0,0,0,0,0,0,0,0,0,0,0,0,0,0,0,0,0,0,0,0,0,0,0,0,0,0,0,0,0,0,0,0,0,0,0,0,0,null,"32.Reumatologie",null,35,0,0,0]
["33.Chirurgie cardiovasculară",null,36,0,0,0,0,0,0,0,0,0,0,0,0,0,0,0,0,0,0,0,0,0,0,0,0,0,0,0,0,0,0,0,0,0,0,0,0,0,0,0,0,0,0,0,0,0,0,0,0,0,0,0,0,0,0,0,0,0,0,0,0,0,0,0,0,0,0,0,0,0,0,0,0,0,0,0,0,0,0,0,0,0,0,0,0,0,0,0,0,0,0,0,0,0,0,0,0,0,0,0,0,0,0,0,0,0,0,0,0,0,0,0,0,null,"33.Chirurgie cardiovasculară",null,36,0,0,0]
["34.Chirurgie generală",null,37,0,0,0,0,0,0,0,0,0,0,0,0,0,0,0,0,0,0,0,0,0,0,0,0,0,0,0,0,0,0,0,0,0,0,0,0,0,0,0,0,0,0,0,0,0,0,0,0,0,0,0,0,0,0,0,0,0,0,0,0,0,0,0,0,0,0,0,0,0,0,0,0,0,0,0,0,0,0,0,0,0,0,0,0,0,0,0,0,0,0,0,0,0,0,0,0,0,0,0,0,0,0,0,0,0,0,0,0,0,0,0,0,null,"34.Chirurgie generală",null,37,0,0,0]
["35.Chirurgie orală şi maxilo- facială",null,38,0,0,0,0,0,0,0,0,0,0,0,0,0,0,0,0,0,0,0,0,0,0,0,0,0,0,0,0,0,0,0,0,0,0,0,0,0,0,0,0,0,0,0,0,0,0,0,0,0,0,0,0,0,0,0,0,0,0,0,0,0,0,0,0,0,0,0,0,0,0,0,0,0,0,0,0,0,0,0,0,0,0,0,0,0,0,0,0,0,0,0,0,0,0,0,0,0,0,0,0,0,0,0,0,0,0,0,0,0,0,0,0,null,"35.Chirurgie orală şi maxilo- facială",null,38,0,0,0]
["36.Chirurgie pediatrică",null,39,0,0,0,0,0,0,0,0,0,0,0,0,0,0,0,0,0,0,0,0,0,0,0,0,0,0,0,0,0,0,0,0,0,0,0,0,0,0,0,0,0,0,0,0,0,0,0,0,0,0,0,0,0,0,0,0,0,0,0,0,0,0,0,0,0,0,0,0,0,0,0,0,0,0,0,0,0,0,0,0,0,0,0,0,0,0,0,0,0,0,0,0,0,0,0,0,0,0,0,0,0,0,0,0,0,0,0,0,0,0,0,0,null,"36.Chirurgie pediatrică",null,39,{"$f":"+D231-D146","v":0},{"$f":"+E231-E146","v":0},{"$f":"+F231-F146","v":0}]
["37.Chirurgie plastică-microchir. reconstructivă",null,40,0,0,0,0,0,0,0,0,0,0,0,0,0,0,0,0,0,0,0,0,0,0,0,0,0,0,0,0,0,0,0,0,0,0,0,0,0,0,0,0,0,0,0,0,0,0,0,0,0,0,0,0,0,0,0,0,0,0,0,0,0,0,0,0,0,0,0,0,0,0,0,0,0,0,0,0,0,0,0,0,0,0,0,0,0,0,0,0,0,0,0,0,0,0,0,0,0,0,0,0,0,0,0,0,0,0,0,0,0,0,0,0,null,"37.Chirurgie plastică-microchir. reconstructivă",null,40,{"$f":"+D232-D147","v":0},0,0]
["38.Chirurgie plastică, estetică și microchirurgie reconstructivă",null,41,{"$f":"+E148+F148","v":0},{"$f":"+Q148+T148+W148+Z148+AC148+AF148+AI148+AL148+AO148+AR148+AU148+AX148+BA148+BD148+BG148+BJ148+BM148+BP148+BS148+BV148+BY148+CB148+CE148+CH148+CK148+CN148+CQ148+CT148+CW148+CZ148","v":0},{"$f":"R148+U148+X148+AA148+AD148+AG148+AJ148+AM148+AP148+AS148+AV148+AY148+BB148+BE148+BH148+BK148+BN148+BQ148+BT148+BW148+BZ148+CC148+CF148+CI148+CL148+CO148+CR148+CU148+CX148+DA148","v":0},0,{"$f":"+G148-I148","v":0},0,0,{"$f":"+J148-L148","v":0},0,0,{"$f":"+M148-O148","v":0},0,0,{"$f":"+P148-R148","v":0},0,0,{"$f":"+S148-U148","v":0},0,0,{"$f":"+V148-X148","v":0},0,0,{"$f":"+Y148-AA148","v":0},0,0,{"$f":"+AB148-AD148","v":0},0,0,{"$f":"+AE148-AG148","v":0},0,0,{"$f":"+AH148-AJ148","v":0},0,0,{"$f":"+AK148-AM148","v":0},0,0,{"$f":"+AN148-AP148","v":0},0,0,{"$f":"+AQ148-AS148","v":0},0,0,{"$f":"+AT148-AV148","v":0},0,0,{"$f":"+AW148-AY148","v":0},0,0,{"$f":"+AZ148-BB148","v":0},0,0,{"$f":"+BC148-BE148","v":0},0,0,{"$f":"+BF148-BH148","v":0},0,0,{"$f":"+BI148-BK148","v":0},0,0,{"$f":"+BL148-BN148","v":0},0,0,{"$f":"+BO148-BQ148","v":0},0,0,{"$f":"+BR148-BT148","v":0},0,0,{"$f":"+BU148-BW148","v":0},0,0,{"$f":"+BX148-BZ148","v":0},0,0,{"$f":"+CA148-CC148","v":0},0,0,{"$f":"+CD148-CF148","v":0},0,0,{"$f":"+CG148-CI148","v":0},0,0,{"$f":"+CJ148-CL148","v":0},0,0,{"$f":"+CM148-CO148","v":0},0,0,{"$f":"+CP148-CR148","v":0},0,0,{"$f":"+CS148-CU148","v":0},0,0,{"$f":"+CV148-CX148","v":0},0,0,{"$f":"+CY148-DA148","v":0},0,0,0,0,0,0,0,0,0,0,0,null,"38.Chirurgie plastică, estetică și microchirurgie reconstructivă",null,41,{"$f":"+D233-D148","v":0},0,0]
["39.Chirurgie toracică",null,42,0,0,0,0,0,0,0,0,0,0,0,0,0,0,0,0,0,0,0,0,0,0,0,0,0,0,0,0,0,0,0,0,0,0,0,0,0,0,0,0,0,0,0,0,0,0,0,0,0,0,0,0,0,0,0,0,0,0,0,0,0,0,0,0,0,0,0,0,0,0,0,0,0,0,0,0,0,0,0,0,0,0,0,0,0,0,0,0,0,0,0,0,0,0,0,0,0,0,0,0,0,0,0,0,0,0,0,0,0,0,0,0,null,"39.Chirurgie toracică",null,42,{"$f":"+D234-D149","v":0},0,0]
["40.Chirurgie vasculară",null,43,0,0,0,0,0,0,0,0,0,0,0,0,0,0,0,0,0,0,0,0,0,0,0,0,0,0,0,0,0,0,0,0,0,0,0,0,0,0,0,0,0,0,0,0,0,0,0,0,0,0,0,0,0,0,0,0,0,0,0,0,0,0,0,0,0,0,0,0,0,0,0,0,0,0,0,0,0,0,0,0,0,0,0,0,0,0,0,0,0,0,0,0,0,0,0,0,0,0,0,0,0,0,0,0,0,0,0,0,0,0,0,0,null,"40.Chirurgie vasculară",null,43,{"$f":"+D235-D150","v":0},0,0]
["41. Neurochirurgie",null,44,0,0,0,0,0,0,0,0,0,0,0,0,0,0,0,0,0,0,0,0,0,0,0,0,0,0,0,0,0,0,0,0,0,0,0,0,0,0,0,0,0,0,0,0,0,0,0,0,0,0,0,0,0,0,0,0,0,0,0,0,0,0,0,0,0,0,0,0,0,0,0,0,0,0,0,0,0,0,0,0,0,0,0,0,0,0,0,0,0,0,0,0,0,0,0,0,0,0,0,0,0,0,0,0,0,0,0,0,0,0,0,0,null,"41. Neurochirurgie",null,44,{"$f":"+D236-D151","v":0},0,0]
["42.Obstetrică- ginecologie",null,45,0,0,0,0,0,0,0,0,0,0,0,0,0,0,0,0,0,0,0,0,0,0,0,0,0,0,0,0,0,0,0,0,0,0,0,0,0,0,0,0,0,0,0,0,0,0,0,0,0,0,0,0,0,0,0,0,0,0,0,0,0,0,0,0,0,0,0,0,0,0,0,0,0,0,0,0,0,0,0,0,0,0,0,0,0,0,0,0,0,0,0,0,0,0,0,0,0,0,0,0,0,0,0,0,0,0,0,0,0,0,0,0,null,"42.Obstetrică- ginecologie",null,45,{"$f":"+D237-D152","v":0},0,0]
["43.Oftalmologie",null,46,0,0,0,0,0,0,0,0,0,0,0,0,0,0,0,0,0,0,0,0,0,0,0,0,0,0,0,0,0,0,0,0,0,0,0,0,0,0,0,0,0,0,0,0,0,0,0,0,0,0,0,0,0,0,0,0,0,0,0,0,0,0,0,0,0,0,0,0,0,0,0,0,0,0,0,0,0,0,0,0,0,0,0,0,0,0,0,0,0,0,0,0,0,0,0,0,0,0,0,0,0,0,0,0,0,0,0,0,0,0,0,0,null,"43.Oftalmologie",null,46,{"$f":"+D238-D153","v":0},0,0]
["44. Ortopedie pediatrică",null,47,0,0,0,0,0,0,0,0,0,0,0,0,0,0,0,0,0,0,0,0,0,0,0,0,0,0,0,0,0,0,0,0,0,0,0,0,0,0,0,0,0,0,0,0,0,0,0,0,0,0,0,0,0,0,0,0,0,0,0,0,0,0,0,0,0,0,0,0,0,0,0,0,0,0,0,0,0,0,0,0,0,0,0,0,0,0,0,0,0,0,0,0,0,0,0,0,0,0,0,0,0,0,0,0,0,0,0,0,0,0,0,0,null,"44. Ortopedie pediatrică",null,47,{"$f":"+D239-D154","v":0},0,0]
["45.Ortopedie şi traumatologie",null,48,0,0,0,0,0,0,0,0,0,0,0,0,0,0,0,0,0,0,0,0,0,0,0,0,0,0,0,0,0,0,0,0,0,0,0,0,0,0,0,0,0,0,0,0,0,0,0,0,0,0,0,0,0,0,0,0,0,0,0,0,0,0,0,0,0,0,0,0,0,0,0,0,0,0,0,0,0,0,0,0,0,0,0,0,0,0,0,0,0,0,0,0,0,0,0,0,0,0,0,0,0,0,0,0,0,0,0,0,0,0,0,0,null,"45.Ortopedie şi traumatologie",null,48,{"$f":"+D240-D155","v":0},0,0]
["46.O.R.L.",null,49,0,0,0,0,0,0,0,0,0,0,0,0,0,0,0,0,0,0,0,0,0,0,0,0,0,0,0,0,0,0,0,0,0,0,0,0,0,0,0,0,0,0,0,0,0,0,0,0,0,0,0,0,0,0,0,0,0,0,0,0,0,0,0,0,0,0,0,0,0,0,0,0,0,0,0,0,0,0,0,0,0,0,0,0,0,0,0,0,0,0,0,0,0,0,0,0,0,0,0,0,0,0,0,0,0,0,0,0,0,0,0,0,null,"46.O.R.L.",null,49,{"$f":"+D241-D156","v":0},0,0]
["47. Urologie",null,50,0,0,0,0,0,0,0,0,0,0,0,0,0,0,0,0,0,0,0,0,0,0,0,0,0,0,0,0,0,0,0,0,0,0,0,0,0,0,0,0,0,0,0,0,0,0,0,0,0,0,0,0,0,0,0,0,0,0,0,0,0,0,0,0,0,0,0,0,0,0,0,0,0,0,0,0,0,0,0,0,0,0,0,0,0,0,0,0,0,0,0,0,0,0,0,0,0,0,0,0,0,0,0,0,0,0,0,0,0,0,0,0,null,"47. Urologie",null,50,{"$f":"+D242-D157","v":0},0,0]
["48.Anatomie patologică",null,51,0,0,0,0,0,0,0,0,0,0,0,0,0,0,0,0,0,0,0,0,0,0,0,0,0,0,0,0,0,0,0,0,0,0,0,0,0,0,0,0,0,0,0,0,0,0,0,0,0,0,0,0,0,0,0,0,0,0,0,0,0,0,0,0,0,0,0,0,0,0,0,0,0,0,0,0,0,0,0,0,0,0,0,0,0,0,0,0,0,0,0,0,0,0,0,0,0,0,0,0,0,0,0,0,0,0,0,0,0,0,0,0,null,"48.Anatomie patologică",null,51,{"$f":"+D243-D158","v":0},0,0]
["49.Epidemiologie",null,52,0,0,0,0,0,0,0,0,0,0,0,0,0,0,0,0,0,0,0,0,0,0,0,0,0,0,0,0,0,0,0,0,0,0,0,0,0,0,0,0,0,0,0,0,0,0,0,0,0,0,0,0,0,0,0,0,0,0,0,0,0,0,0,0,0,0,0,0,0,0,0,0,0,0,0,0,0,0,0,0,0,0,0,0,0,0,0,0,0,0,0,0,0,0,0,0,0,0,0,0,0,0,0,0,0,0,0,0,0,0,0,0,null,"49.Epidemiologie",null,52,{"$f":"+D244-D159","v":0},0,0]
["50.Igienă",null,53,0,0,0,0,0,0,0,0,0,0,0,0,0,0,0,0,0,0,0,0,0,0,0,0,0,0,0,0,0,0,0,0,0,0,0,0,0,0,0,0,0,0,0,0,0,0,0,0,0,0,0,0,0,0,0,0,0,0,0,0,0,0,0,0,0,0,0,0,0,0,0,0,0,0,0,0,0,0,0,0,0,0,0,0,0,0,0,0,0,0,0,0,0,0,0,0,0,0,0,0,0,0,0,0,0,0,0,0,0,0,0,0,null,"50.Igienă",null,53,{"$f":"+D245-D160","v":0},0,0]
["51.Medicină de laborator",null,54,0,0,0,0,0,0,0,0,0,0,0,0,0,0,0,0,0,0,0,0,0,0,0,0,0,0,0,0,0,0,0,0,0,0,0,0,0,0,0,0,0,0,0,0,0,0,0,0,0,0,0,0,0,0,0,0,0,0,0,0,0,0,0,0,0,0,0,0,0,0,0,0,0,0,0,0,0,0,0,0,0,0,0,0,0,0,0,0,0,0,0,0,0,0,0,0,0,0,0,0,0,0,0,0,0,0,0,0,0,0,0,0,null,"51.Medicină de laborator",null,54,{"$f":"+D246-D161","v":0},0,0]
["52. Medicină legală",null,55,0,0,0,0,0,0,0,0,0,0,0,0,0,0,0,0,0,0,0,0,0,0,0,0,0,0,0,0,0,0,0,0,0,0,0,0,0,0,0,0,0,0,0,0,0,0,0,0,0,0,0,0,0,0,0,0,0,0,0,0,0,0,0,0,0,0,0,0,0,0,0,0,0,0,0,0,0,0,0,0,0,0,0,0,0,0,0,0,0,0,0,0,0,0,0,0,0,0,0,0,0,0,0,0,0,0,0,0,0,0,0,0,null,"52. Medicină legală",null,55,{"$f":"+D247-D162","v":0},0,0]
["53. Medicină nucleară",null,56,0,0,0,0,0,0,0,0,0,0,0,0,0,0,0,0,0,0,0,0,0,0,0,0,0,0,0,0,0,0,0,0,0,0,0,0,0,0,0,0,0,0,0,0,0,0,0,0,0,0,0,0,0,0,0,0,0,0,0,0,0,0,0,0,0,0,0,0,0,0,0,0,0,0,0,0,0,0,0,0,0,0,0,0,0,0,0,0,0,0,0,0,0,0,0,0,0,0,0,0,0,0,0,0,0,0,0,0,0,0,0,0,null,"53. Medicină nucleară",null,56,{"$f":"+D248-D163","v":0},0,0]
["54.Radiologie – imagistică medicală",null,57,0,0,0,0,0,0,0,0,0,0,0,0,0,0,0,0,0,0,0,0,0,0,0,0,0,0,0,0,0,0,0,0,0,0,0,0,0,0,0,0,0,0,0,0,0,0,0,0,0,0,0,0,0,0,0,0,0,0,0,0,0,0,0,0,0,0,0,0,0,0,0,0,0,0,0,0,0,0,0,0,0,0,0,0,0,0,0,0,0,0,0,0,0,0,0,0,0,0,0,0,0,0,0,0,0,0,0,0,0,0,0,0,null,"54.Radiologie – imagistică medicală",null,57,{"$f":"+D249-D164","v":0},0,0]
["55.Sănătate publică şi management",null,58,0,0,0,0,0,0,0,0,0,0,0,0,0,0,0,0,0,0,0,0,0,0,0,0,0,0,0,0,0,0,0,0,0,0,0,0,0,0,0,0,0,0,0,0,0,0,0,0,0,0,0,0,0,0,0,0,0,0,0,0,0,0,0,0,0,0,0,0,0,0,0,0,0,0,0,0,0,0,0,0,0,0,0,0,0,0,0,0,0,0,0,0,0,0,0,0,0,0,0,0,0,0,0,0,0,0,0,0,0,0,0,0,null,"55.Sănătate publică şi management",null,58,{"$f":"+D250-D165","v":0},0,0]
["II. DENTIŞTI -  TOTAL,                      din care:",null,59,0,0,0,0,0,0,0,0,0,0,0,0,0,0,0,0,0,0,0,0,0,0,0,0,0,0,0,0,0,0,0,0,0,0,0,0,0,0,0,0,0,0,0,0,0,0,0,0,0,0,0,0,0,0,0,0,0,0,0,0,0,0,0,0,0,0,0,0,0,0,0,0,0,0,0,0,0,0,0,0,0,0,0,0,0,0,0,0,0,0,0,0,0,0,0,0,0,0,0,0,0,0,0,0,0,0,0,0,0,0,0,0,null,"II. DENTIŞTI -  TOTAL,                      din care:",null,59,{"$f":"+D251-D166","v":0},{"$f":"+E251-E166","v":0},{"$f":"+F251-F166","v":0}]
["           - rezidenţi",null,60,0,0,0,0,0,0,0,0,0,0,0,0,0,0,0,0,0,0,0,0,0,0,0,0,0,0,0,0,0,0,0,0,0,0,0,0,0,0,0,0,0,0,0,0,0,0,0,0,0,0,0,0,0,0,0,0,0,0,0,0,0,0,0,0,0,0,0,0,0,0,0,0,0,0,0,0,0,0,0,0,0,0,0,0,0,0,0,0,0,0,0,0,0,0,0,0,0,0,0,0,0,0,0,0,0,0,0,0,0,0,0,0,null,"           - rezidenţi",null,60,{"$f":"+D252-D167","v":0},0,0]
["1. Chirurgie dento-alveolară",null,61,0,0,0,0,0,0,0,0,0,0,0,0,0,0,0,0,0,0,0,0,0,0,0,0,0,0,0,0,0,0,0,0,0,0,0,0,0,0,0,0,0,0,0,0,0,0,0,0,0,0,0,0,0,0,0,0,0,0,0,0,0,0,0,0,0,0,0,0,0,0,0,0,0,0,0,0,0,0,0,0,0,0,0,0,0,0,0,0,0,0,0,0,0,0,0,0,0,0,0,0,0,0,0,0,0,0,0,0,0,0,0,0,null,"1. Chirurgie dento-alveolară",null,61,{"$f":"+D253-D168","v":0},0,0]
["2. Ortodonţie şi ortopedie dento-facială",null,62,0,0,0,0,0,0,0,0,0,0,0,0,0,0,0,0,0,0,0,0,0,0,0,0,0,0,0,0,0,0,0,0,0,0,0,0,0,0,0,0,0,0,0,0,0,0,0,0,0,0,0,0,0,0,0,0,0,0,0,0,0,0,0,0,0,0,0,0,0,0,0,0,0,0,0,0,0,0,0,0,0,0,0,0,0,0,0,0,0,0,0,0,0,0,0,0,0,0,0,0,0,0,0,0,0,0,0,0,0,0,0,0,null,"2. Ortodonţie şi ortopedie dento-facială",null,62,{"$f":"+D254-D169","v":0},0,0]
["III. FARMACIŞTI – TOTAL,              din care:",null,63,0,0,0,0,{"$f":"+G170-I170","v":0},0,0,0,0,0,0,0,0,0,0,0,0,0,0,0,0,0,0,0,0,0,0,0,0,0,0,0,0,0,0,0,0,0,0,0,0,0,0,0,0,0,0,0,0,0,0,0,0,0,0,0,0,0,0,0,0,0,0,0,0,0,0,0,0,0,0,0,0,0,0,0,0,0,0,0,0,0,0,0,0,0,0,0,0,0,0,0,0,0,0,0,0,0,0,0,0,0,0,0,0,0,0,0,0,0,0,0,null,"III. FARMACIŞTI – TOTAL,              din care:",null,63,{"$f":"+D255-D170","v":0},0,0]
["          - rezidenţi",null,64,0,0,0,0,{"$f":"+G171-I171","v":0},0,0,0,0,0,0,0,0,0,0,0,0,0,0,0,0,0,0,0,0,0,0,0,0,0,0,0,0,0,0,0,0,0,0,0,0,0,0,0,0,0,0,0,0,0,0,0,0,0,0,0,0,0,0,0,0,0,0,0,0,0,0,0,0,0,0,0,0,0,0,0,0,0,0,0,0,0,0,0,0,0,0,0,0,0,0,0,0,0,0,0,0,0,0,0,0,0,0,0,0,0,0,0,0,0,0,0,null,"          - rezidenţi",null,64,{"$f":"+D256-D171","v":0},0,0]
["1. Farmacie clinică",null,65,0,0,0,0,0,0,0,0,0,0,0,0,0,0,0,0,0,0,0,0,0,0,0,0,0,0,0,0,0,0,0,0,0,0,0,0,0,0,0,0,0,0,0,0,0,0,0,0,0,0,0,0,0,0,0,0,0,0,0,0,0,0,0,0,0,0,0,0,0,0,0,0,0,0,0,0,0,0,0,0,0,0,0,0,0,0,0,0,0,0,0,0,0,0,0,0,0,0,0,0,0,0,0,0,0,0,0,0,0,0,0,0,null,"1. Farmacie clinică",null,65,{"$f":"+D257-D172","v":0},0,0]
["2. Laborator farmaceutic",null,66,0,0,0,0,0,0,0,0,0,0,0,0,0,0,0,0,0,0,0,0,0,0,0,0,0,0,0,0,0,0,0,0,0,0,0,0,0,0,0,0,0,0,0,0,0,0,0,0,0,0,0,0,0,0,0,0,0,0,0,0,0,0,0,0,0,0,0,0,0,0,0,0,0,0,0,0,0,0,0,0,0,0,0,0,0,0,0,0,0,0,0,0,0,0,0,0,0,0,0,0,0,0,0,0,0,0,0,0,0,0,0,0,null,"2. Laborator farmaceutic",null,66,{"$f":"+D258-D173","v":0},0,0]
["IV. FIZIOKINETOTERAPEUŢI (fiziokinetoterapeuți, kinetoterapeuți, fizioterapeuți, profesori CFM) - TOTAL, din care:",null,67,0,0,0,0,0,0,0,0,0,0,0,0,0,0,0,0,0,0,0,0,0,0,0,0,0,0,0,0,0,0,0,0,0,0,0,0,0,0,0,0,0,0,0,0,0,0,0,0,0,0,0,0,0,0,0,0,0,0,0,0,0,0,0,0,0,0,0,0,0,0,0,0,0,0,0,0,0,0,0,0,0,0,0,0,0,0,0,0,0,0,0,0,0,0,0,0,0,0,0,0,0,0,0,0,0,0,0,0,0,0,0,0,null,"IV. FIZIOKINETOTERAPEUŢI - TOTAL, din care:",null,67,{"$f":"+D259-D174","v":0},0,0]
["          - fizioterapeuţi  ",null,68,0,0,0,0,0,0,0,0,0,0,0,0,0,0,0,0,0,0,0,0,0,0,0,0,0,0,0,0,0,0,0,0,0,0,0,0,0,0,0,0,0,0,0,0,0,0,0,0,0,0,0,0,0,0,0,0,0,0,0,0,0,0,0,0,0,0,0,0,0,0,0,0,0,0,0,0,0,0,0,0,0,0,0,0,0,0,0,0,0,0,0,0,0,0,0,0,0,0,0,0,0,0,0,0,0,0,0,0,0,0,0,0,null,"          - fizioterapeuţi  ",null,68,{"$f":"+D260-D175","v":0},0,0]
["V. ASISTENŢI MEDICALI CU STUDII SUPERIOARE - TOTAL,       din care:",null,69,0,0,0,0,0,0,0,0,0,0,0,0,0,0,0,0,0,0,0,0,0,0,0,0,0,0,0,0,0,0,0,0,0,0,0,0,0,0,0,0,0,0,0,0,0,0,0,0,0,0,0,0,0,0,0,0,0,0,0,0,0,0,0,0,0,0,0,0,0,0,0,0,0,0,0,0,0,0,0,0,0,0,0,0,0,0,0,0,0,0,0,0,0,0,0,0,0,0,0,0,0,0,0,0,0,0,0,0,0,0,0,0,null,"V. ASISTENŢI MEDICALI CU STUDII SUPERIOARE - TOTAL,       din care:",null,69,{"$f":"+D261-D176","v":0},0,0]
["       - asistenţi medicali obstetrică-ginecologie (moaşe)",null,70,{"$f":"+E177+F177","v":0},{"$f":"+Q177+T177+W177+Z177+AC177+AF177+AI177+AL177+AO177+AR177+AU177+AX177+BA177+BD177+BG177+BJ177+BM177+BP177+BS177+BV177+BY177+CB177+CE177+CH177+CK177+CN177+CQ177+CT177+CW177+CZ177","v":0},{"$f":"R177+U177+X177+AA177+AD177+AG177+AJ177+AM177+AP177+AS177+AV177+AY177+BB177+BE177+BH177+BK177+BN177+BQ177+BT177+BW177+BZ177+CC177+CF177+CI177+CL177+CO177+CR177+CU177+CX177+DA177","v":0},0,0,0,0,0,0,0,{"$f":"+M177-O177","v":0},0,0,0,0,0,0,0,0,0,0,0,0,0,0,0,0,0,0,0,0,0,0,0,0,0,0,0,0,0,0,0,0,0,0,0,0,0,0,0,0,0,0,0,0,0,0,0,0,0,0,0,0,0,0,0,0,0,0,0,0,0,0,0,0,0,0,0,0,0,0,0,0,0,0,0,0,0,0,0,0,0,0,0,0,0,0,0,0,0,0,0,0,0,0,0,0,0,0,0,0,0,null,"       - asistenţi medicali obstetrică- ginecologie (moaşe)",null,70,{"$f":"+D262-D177","v":0},0,0]
["VI. ALT PERSONAL SANITAR SUPERIOR (biologi, chimişti, logopezi, psihologi) - TOTAL, din care:",null,71,{"$f":"+E178+F178","v":0},{"$f":"+Q178+T178+W178+Z178+AC178+AF178+AI178+AL178+AO178+AR178+AU178+AX178+BA178+BD178+BG178+BJ178+BM178+BP178+BS178+BV178+BY178+CB178+CE178+CH178+CK178+CN178+CQ178+CT178+CW178+CZ178","v":0},{"$f":"R178+U178+X178+AA178+AD178+AG178+AJ178+AM178+AP178+AS178+AV178+AY178+BB178+BE178+BH178+BK178+BN178+BQ178+BT178+BW178+BZ178+CC178+CF178+CI178+CL178+CO178+CR178+CU178+CX178+DA178","v":0},0,0,0,0,{"$f":"+J178-L178","v":0},0,0,{"$f":"+M178-O178","v":0},0,0,0,0,0,0,0,0,0,0,0,0,0,0,0,0,0,0,0,0,0,0,0,0,0,0,0,0,0,0,0,0,0,0,0,0,0,0,0,0,0,0,0,0,0,0,0,0,0,0,0,0,0,0,0,0,0,0,0,0,0,0,0,0,0,0,0,0,0,0,0,0,0,0,0,0,0,0,0,0,0,0,0,0,0,0,0,0,0,0,0,0,0,0,0,0,0,0,0,0,0,null,"VI. ALT PERSONAL SANITAR SUPERIOR (biologi, chimişti, logopezi, psihologi) TOTAL, din care:",null,71,{"$f":"+D263-D178","v":0},0,0]
["       - psihologi",null,72,{"$f":"+E179+F179","v":0},{"$f":"+Q179+T179+W179+Z179+AC179+AF179+AI179+AL179+AO179+AR179+AU179+AX179+BA179+BD179+BG179+BJ179+BM179+BP179+BS179+BV179+BY179+CB179+CE179+CH179+CK179+CN179+CQ179+CT179+CW179+CZ179","v":0},{"$f":"R179+U179+X179+AA179+AD179+AG179+AJ179+AM179+AP179+AS179+AV179+AY179+BB179+BE179+BH179+BK179+BN179+BQ179+BT179+BW179+BZ179+CC179+CF179+CI179+CL179+CO179+CR179+CU179+CX179+DA179","v":0},0,0,0,0,{"$f":"+J179-L179","v":0},0,0,{"$f":"+M179-O179","v":0},0,0,{"$f":"+P179-R179","v":0},0,0,{"$f":"+S179-U179","v":0},0,0,{"$f":"+V179-X179","v":0},0,0,{"$f":"+Y179-AA179","v":0},0,0,{"$f":"+AB179-AD179","v":0},0,0,{"$f":"+AE179-AG179","v":0},0,0,{"$f":"+AH179-AJ179","v":0},0,0,{"$f":"+AK179-AM179","v":0},0,0,{"$f":"+AN179-AP179","v":0},0,0,{"$f":"+AQ179-AS179","v":0},0,0,{"$f":"+AT179-AV179","v":0},0,0,{"$f":"+AW179-AY179","v":0},0,0,{"$f":"+AZ179-BB179","v":0},0,0,{"$f":"+BC179-BE179","v":0},0,0,{"$f":"+BF179-BH179","v":0},0,0,{"$f":"+BI179-BK179","v":0},0,0,{"$f":"+BL179-BN179","v":0},0,0,{"$f":"+BO179-BQ179","v":0},0,0,{"$f":"+BR179-BT179","v":0},0,0,{"$f":"+BU179-BW179","v":0},0,0,{"$f":"+BX179-BZ179","v":0},0,0,{"$f":"+CA179-CC179","v":0},0,0,{"$f":"+CD179-CF179","v":0},0,0,{"$f":"+CG179-CI179","v":0},0,0,{"$f":"+CJ179-CL179","v":0},0,0,{"$f":"+CM179-CO179","v":0},0,0,{"$f":"+CP179-CR179","v":0},0,0,{"$f":"+CS179-CU179","v":0},0,0,{"$f":"+CV179-CX179","v":0},0,0,{"$f":"+CY179-DA179","v":0},0,0,{"$f":"+DB179-DD179","v":0},0,0,{"$f":"+DE179-DG179","v":0},0,0,{"$f":"+DH179-DJ179","v":0},0,0,null,"       - psihologi",null,72,{"$f":"+D264-D179","v":0},0,0]
["VII. ALT PERSONAL CU STUDII SUPERIOARE (economişti,jurişti, ingineri etc.)",null,73,{"$f":"+E180+F180","v":0},{"$f":"+Q180+T180+W180+Z180+AC180+AF180+AI180+AL180+AO180+AR180+AU180+AX180+BA180+BD180+BG180+BJ180+BM180+BP180+BS180+BV180+BY180+CB180+CE180+CH180+CK180+CN180+CQ180+CT180+CW180+CZ180","v":0},{"$f":"R180+U180+X180+AA180+AD180+AG180+AJ180+AM180+AP180+AS180+AV180+AY180+BB180+BE180+BH180+BK180+BN180+BQ180+BT180+BW180+BZ180+CC180+CF180+CI180+CL180+CO180+CR180+CU180+CX180+DA180","v":0},0,0,0,0,0,0,0,{"$f":"+M180-O180","v":0},0,0,0,0,0,0,0,0,0,0,0,0,0,0,0,0,0,0,0,0,0,0,0,0,0,0,0,0,0,0,0,0,0,0,0,0,0,0,0,0,0,0,0,0,0,0,0,0,0,0,0,0,0,0,0,0,0,0,0,0,0,0,0,0,0,0,0,0,0,0,0,0,0,0,0,0,0,0,0,0,0,0,0,0,0,0,0,0,0,0,0,0,0,0,0,0,0,0,0,0,0,null,"VII. ALT PERSONAL CU STUDII SUPERIOARE (economişti,jurişti, ingineri etc)",null,73,{"$f":"+D265-D180","v":0},0,0]
[null,"U.M.F. *)  - este trecut personalul sanitar cu cartea de muncă la Universitatatea de Medicină şi Farmacie şi care are integrare clinică. Nu se prinde în total ( coloana 01)."]
[]
[]
[]
["Cap.15. PERSONAL SANITAR CU STUDII SUPERIOARE PE GRUPE DE VÂRSTĂ"]
["D"]
["CATEGORII DE PERSONAL",null,"Randul","TOTAL",null,null,"            Repartizarea personalului cu studii superioare pe grupe de vârstă",null,null,null,null,null,null,null,null,null,null,null,null,null,null,null,null,null,"Cu normă întreagă"]
[null,null,null,"TOTAL","MASCULIN","FEMININ","Sub 25 ani",null,null,"25-34 ani",null,null,"35-44 ani",null,null,"45-54 ani",null,null,"55-64 ani",null,null,"65 ani şi peste",null,null,"Total",null,null,"din care: in spital, centru de sanatate cu paturi, san. TBC, preventorii, san. de nevroze/neuropsihiatrie, san. balneare"]
[null,null,null,null,null,null,"Total","din care:",null,"Total","din care:",null,"Total","din care:",null,"Total","din care:",null,"Total","din care:",null,"Total","din care:",null,"Total","din care:",null,"Total","din care:"]
[null,null,null,null,null,null,null,"masculin","feminin",null,"masculin","feminin",null,"masculin","feminin",null,"masculin","feminin",null,"masculin","feminin",null,"masculin","feminin",null,"masculin","feminin",null,"masculin","feminin"]
["A",null,"B",1,2,3,4,5,6,7,8,9,10,11,12,13,14,15,16,17,18,19,20,21,22,23,24,25,26,27]
["TOTAL PERSONAL CU STUDII SUPERIOARE (rândurile  2+60+64+68+70+72+73)",null,1,{"$f":"+D193+D251+D255+D259+D261+D263+D265","v":0},0,0,0,0,0,0,0,0,0,0,0,0,0,0,0,0,0,0,0,0,0,0,0,0,0,0]
["I. MEDICI (EXCLUSIV DENTIŞTI) – TOTAL     (rândurile  4+......+59),                   din care:",null,2,{"$f":"SUM(D195:D250)-D230","v":0},{"$f":"SUM(E195:E250)-E230","v":0},0,0,0,0,0,0,0,0,0,0,0,0,0,0,0,0,0,0,0,0,0,0,0,0,0]
["                    - rezidenţi ",null,3,{"$f":"+E194+F194","v":0},{"$f":"+H194+K194+N194+Q194+T194+W194","v":0},{"$f":"+I194+L194+O194+R194+U194+X194","v":0},0,{"$f":"+G194-I194","v":0},0,0,{"$f":"+J194-L194","v":0},0,0,{"$f":"+M194-O194","v":0},0,0,{"$f":"+P194-R194","v":0},0,0,{"$f":"+S194-U194","v":0},0,0,{"$f":"+V194-X194","v":0},0,0,{"$f":"+Y194-AA194","v":0},0,0,{"$f":"+AB194-AD194","v":0},0,{"$f":"IF((E194>=Z194),\"OK\",\"Err\")","v":"OK"},"OK",{"$f":"IF((Z194>=AC194),\"OK\",\"Err\")","v":"OK"},"OK"]
["1. Alergologie şi imunologie clinică",null,4,{"$f":"+E195+F195","v":0},{"$f":"+H195+K195+N195+Q195+T195+W195","v":0},0,0,{"$f":"+G195-I195","v":0},0,0,{"$f":"+J195-L195","v":0},0,0,{"$f":"+M195-O195","v":0},0,0,{"$f":"+P195-R195","v":0},0,0,{"$f":"+S195-U195","v":0},0,0,{"$f":"+V195-X195","v":0},0,0,{"$f":"+Y195-AA195","v":0},0,0,{"$f":"+AB195-AD195","v":0},0,"OK","OK","OK","OK"]
["2. A.T.I.",null,5,0,0,0,0,0,0,0,0,0,0,0,0,0,0,0,0,0,0,0,0,0,0,0,0,0,0,0,"OK","OK","OK","OK"]
["3. Boli infecţioase",null,6,0,0,0,0,0,0,0,0,0,0,0,0,0,0,0,0,0,0,0,0,0,0,0,0,0,0,0,"OK","OK","OK","OK"]
["4. Cardiologie",null,7,0,0,0,0,0,0,0,0,0,0,0,0,0,0,0,0,0,0,0,0,0,0,0,0,0,0,0,"OK","OK","OK","OK"]
["5. Dermatovenerologie",null,8,0,0,0,0,0,0,0,0,0,0,0,0,0,0,0,0,0,0,0,0,0,0,0,0,0,0,0,"OK","OK","OK","OK"]
["6. Diabet zaharat, nutriţie şi boli metabolice",null,9,0,0,0,0,0,0,0,0,0,0,0,0,0,0,0,0,0,0,0,0,0,0,0,0,0,0,0,"OK","OK","OK","OK"]
["7. Endocrinologie",null,10,0,0,0,0,0,0,0,0,0,0,0,0,0,0,0,0,0,0,0,0,0,0,0,0,0,0,0,"OK","OK","OK","OK"]
["8. Expertiza medicală a capacităţii de muncă",null,11,0,0,0,0,0,0,0,0,0,0,0,0,0,0,0,0,0,0,0,0,0,0,0,0,0,0,0,"OK","OK","OK","OK"]
["9. Farmacologie clinică",null,12,0,0,0,0,0,0,0,0,0,0,0,0,0,0,0,0,0,0,0,0,0,0,0,0,0,0,0,"OK","OK","OK","OK"]
["10. Gastroenterologie",null,13,0,0,0,0,0,0,0,0,0,0,0,0,0,0,0,0,0,0,0,0,0,0,0,0,0,0,0,"OK","OK","OK","OK"]
["11. Genetică medicală",null,14,0,0,0,0,0,0,0,0,0,0,0,0,0,0,0,0,0,0,0,0,0,0,0,0,0,0,0,"OK","OK","OK","OK"]
["12. Geriatrie şi gerontologie",null,15,0,0,0,0,0,0,0,0,0,0,0,0,0,0,0,0,0,0,0,0,0,0,0,0,0,0,0,"OK","OK","OK","OK"]
["13. Hematologie",null,16,0,0,0,0,0,0,0,0,0,0,0,0,0,0,0,0,0,0,0,0,0,0,0,0,0,0,0,"OK","OK","OK","OK"]
["14. Medicină de familie",null,17,0,0,0,0,0,0,0,0,0,0,0,0,0,0,0,0,0,0,0,0,0,0,0,0,0,0,0,"OK","OK","OK","OK"]
["15. Medicină de urgenţă",null,18,0,0,0,0,0,0,0,0,0,0,0,0,0,0,0,0,0,0,0,0,0,0,0,0,0,0,0,"OK","OK","OK","OK"]
["16. Medicină internă",null,19,0,0,0,0,0,0,0,0,0,0,0,0,0,0,0,0,0,0,0,0,0,0,0,0,0,0,0,"OK","OK","OK","OK"]
["17. Medicină generală",null,20,0,0,0,0,0,0,0,0,0,0,0,0,0,0,0,0,0,0,0,0,0,0,0,0,0,0,0,"OK","OK","OK","OK"]
["18. Medicina muncii",null,21,0,0,0,0,0,0,0,0,0,0,0,0,0,0,0,0,0,0,0,0,0,0,0,0,0,0,0,"OK","OK","OK","OK"]
["19. Medicină sportivă",null,22,0,0,0,0,0,0,0,0,0,0,0,0,0,0,0,0,0,0,0,0,0,0,0,0,0,0,0,"OK","OK","OK","OK"]
["20. Nefrologie",null,23,0,0,0,0,0,0,0,0,0,0,0,0,0,0,0,0,0,0,0,0,0,0,0,0,0,0,0,"OK","OK","OK","OK"]
["21. Neonatologie",null,24,0,0,0,0,0,0,0,0,0,0,0,0,0,0,0,0,0,0,0,0,0,0,0,0,0,0,0,"OK","OK","OK","OK"]
["22. Neurologie",null,25,0,0,0,0,0,0,0,0,0,0,0,0,0,0,0,0,0,0,0,0,0,0,0,0,0,0,0,"OK","OK","OK","OK"]
["23. Neurologie pediatrică",null,26,0,0,0,0,0,0,0,0,0,0,0,0,0,0,0,0,0,0,0,0,0,0,0,0,0,0,0,"OK","OK","OK","OK"]
["24. Oncologie medicală",null,27,0,0,0,0,0,0,0,0,0,0,0,0,0,0,0,0,0,0,0,0,0,0,0,0,0,0,0,"OK","OK","OK","OK"]
["25. Pediatrie",null,28,0,0,0,0,0,0,0,0,0,0,0,0,0,0,0,0,0,0,0,0,0,0,0,0,0,0,0,"OK","OK","OK","OK"]
["26. Pneumologie",null,29,0,0,0,0,0,0,0,0,0,0,0,0,0,0,0,0,0,0,0,0,0,0,0,0,0,0,0,"OK","OK","OK","OK"]
["27. Psihiatrie ",null,30,0,0,0,0,0,0,0,0,0,0,0,0,0,0,0,0,0,0,0,0,0,0,0,0,0,0,0,"OK","OK","OK","OK"]
["28. Psihiatrie pediatrică ",null,31,0,0,0,0,0,0,0,0,0,0,0,0,0,0,0,0,0,0,0,0,0,0,0,0,0,0,0,"OK","OK","OK","OK"]
["29. Radioterapie",null,32,0,0,0,0,0,0,0,0,0,0,0,0,0,0,0,0,0,0,0,0,0,0,0,0,0,0,0,"OK","OK","OK","OK"]
["30. Recuperare, medicină fizică şi balneologie",null,33,0,0,0,0,0,0,0,0,0,0,0,0,0,0,0,0,0,0,0,0,0,0,0,0,0,0,0,"OK","OK","OK","OK"]
["31.Reabilitare medicală",null,34,{"$f":"+E225+F225","v":0},{"$f":"+H225+K225+N225+Q225+T225+W225","v":0},{"$f":"+I225+L225+O225+R225+U225+X225","v":0},0,{"$f":"+G225-I225","v":0},0,0,{"$f":"+J225-L225","v":0},0,0,{"$f":"+M225-O225","v":0},0,0,{"$f":"+P225-R225","v":0},0,0,{"$f":"+S225-U225","v":0},0,0,{"$f":"+V225-X225","v":0},0,0,{"$f":"+Y225-AA225","v":0},0,0,{"$f":"+AB225-AD225","v":0},0,{"$f":"IF((E225>=Z225),\"OK\",\"Err\")","v":"OK"},{"$f":"IF((F225>=AA225),\"OK\",\"Err\")","v":"OK"},{"$f":"IF((Z225>=AC225),\"OK\",\"Err\")","v":"OK"},{"$f":"IF((AA225>=AD225),\"OK\",\"Err\")","v":"OK"}]
["32.Reumatologie",null,35,0,0,0,0,0,0,0,0,0,0,0,0,0,0,0,0,0,0,0,0,0,0,0,0,0,0,0,"OK","OK","OK","OK"]
["33.Chirurgie cardiovasculară",null,36,0,0,0,0,0,0,0,0,0,0,0,0,0,0,0,0,0,0,0,0,0,0,0,0,0,0,0,{"$f":"IF((E227>=Z227),\"OK\",\"Err\")","v":"OK"},"OK",{"$f":"IF((Z227>=AC227),\"OK\",\"Err\")","v":"OK"},"OK"]
["34.Chirurgie generală",null,37,0,0,0,0,0,0,0,0,0,0,0,0,0,0,0,0,0,0,0,0,0,0,0,0,0,0,0,"OK","OK","OK","OK"]
["35.Chirurgie orală şi maxilo- facială",null,38,0,0,0,0,0,0,0,0,0,0,0,0,0,0,0,0,0,0,0,0,0,0,0,0,0,0,0,"OK","OK","OK","OK"]
["      - rezidenți de chirurgie orală și maxilo-facială",null,39,0,0,0,0,0,0,0,0,0,0,0,0,0,0,0,0,0,0,0,0,0,0,0,0,0,0,0,"OK","OK","OK","OK"]
["36.Chirurgie pediatrică",null,40,0,0,0,0,0,0,0,0,0,0,0,0,0,0,0,0,0,0,0,0,0,0,0,0,0,0,0,"OK","OK","OK","OK"]
["37.Chirurgie plastică-microchir. reconstructivă",null,41,0,0,0,0,0,0,0,0,0,0,0,0,0,0,0,0,0,0,0,0,0,0,0,0,0,0,0,"OK","OK","OK","OK"]
["38.Chirurgie plastică, estetică și microchirurgie reconstructivă",null,42,{"$f":"+E233+F233","v":0},{"$f":"+H233+K233+N233+Q233+T233+W233","v":0},{"$f":"+I233+L233+O233+R233+U233+X233","v":0},0,{"$f":"+G233-I233","v":0},0,0,{"$f":"+J233-L233","v":0},0,0,{"$f":"+M233-O233","v":0},0,0,{"$f":"+P233-R233","v":0},0,0,{"$f":"+S233-U233","v":0},0,0,{"$f":"+V233-X233","v":0},0,0,{"$f":"+Y233-AA233","v":0},0,0,{"$f":"+AB233-AD233","v":0},0,{"$f":"IF((E233>=Z233),\"OK\",\"Err\")","v":"OK"},{"$f":"IF((F233>=AA233),\"OK\",\"Err\")","v":"OK"},{"$f":"IF((Z233>=AC233),\"OK\",\"Err\")","v":"OK"},{"$f":"IF((AA233>=AD233),\"OK\",\"Err\")","v":"OK"}]
["39.Chirurgie toracică",null,43,0,0,0,0,0,0,0,0,0,0,0,0,0,0,0,0,0,0,0,0,0,0,0,0,0,0,0,"OK","OK","OK","OK"]
["40.Chirurgie vasculară",null,44,0,0,0,0,0,0,0,0,0,0,0,0,0,0,0,0,0,0,0,0,0,0,0,0,0,0,0,"OK","OK","OK","OK"]
["41. Neurochirurgie",null,45,0,0,0,0,0,0,0,0,0,0,0,0,0,0,0,0,0,0,0,0,0,0,0,0,0,0,0,"OK","OK","OK","OK"]
["42.Obstetrică- ginecologie",null,46,0,0,0,0,0,0,0,0,0,0,0,0,0,0,0,0,0,0,0,0,0,0,0,0,0,0,0,"OK","OK","OK","OK"]
["43.Oftalmologie",null,47,0,0,0,0,0,0,0,0,0,0,0,0,0,0,0,0,0,0,0,0,0,0,0,0,0,0,0,"OK","OK","OK","OK"]
["44. Ortopedie pediatrică",null,48,0,0,0,0,0,0,0,0,0,0,0,0,0,0,0,0,0,0,0,0,0,0,0,0,0,0,0,"OK","OK","OK","OK"]
["45.Ortopedie şi traumatologie",null,49,0,0,0,0,0,0,0,0,0,0,0,0,0,0,0,0,0,0,0,0,0,0,0,0,0,0,0,"OK","OK","OK","OK"]
["46.O.R.L.",null,50,0,0,0,0,0,0,0,0,0,0,0,0,0,0,0,0,0,0,0,0,0,0,0,0,0,0,0,"OK","OK","OK","OK"]
["47. Urologie",null,51,0,0,0,0,0,0,0,0,0,0,0,0,0,0,0,0,0,0,0,0,0,0,0,0,0,0,0,"OK","OK","OK","OK"]
["48.Anatomie patologică",null,52,0,0,0,0,0,0,0,0,0,0,0,0,0,0,0,0,0,0,0,0,0,0,0,0,0,0,0,"OK","OK","OK","OK"]
["49.Epidemiologie",null,53,0,0,0,0,0,0,0,0,0,0,0,0,0,0,0,0,0,0,0,0,0,0,0,0,0,0,0,"OK","OK","OK","OK"]
["50.Igienă",null,54,0,0,0,0,0,0,0,0,0,0,0,0,0,0,0,0,0,0,0,0,0,0,0,0,0,0,0,"OK","OK","OK","OK"]
["51.Medicină de laborator",null,55,0,0,0,0,0,0,0,0,0,0,0,0,0,0,0,0,0,0,0,0,0,0,0,0,0,0,0,"OK","OK","OK","OK"]
["52. Medicină legală",null,56,0,0,0,0,0,0,0,0,0,0,0,0,0,0,0,0,0,0,0,0,0,0,0,0,0,0,0,"OK","OK","OK","OK"]
["53. Medicină nucleară",null,57,0,0,0,0,0,0,0,0,0,0,0,0,0,0,0,0,0,0,0,0,0,0,0,0,0,0,0,"OK","OK","OK","OK"]
["54.Radiologie – imagistică medicală",null,58,0,0,0,0,0,0,0,0,0,0,0,0,0,0,0,0,0,0,0,0,0,0,0,0,0,0,0,"OK","OK","OK","OK"]
["55.Sănătate publică şi management",null,59,0,0,0,0,0,0,0,0,0,0,0,0,0,0,0,0,0,0,0,0,0,0,0,0,0,0,0,"OK","OK","OK","OK"]
["II. DENTIŞTI -  TOTAL,                      din care:",null,60,0,0,0,0,0,0,0,0,0,0,0,0,0,0,0,0,0,0,0,0,0,0,0,0,0,0,0,"OK","OK","OK","OK"]
["           - rezidenţi",null,61,0,0,0,0,0,0,0,0,0,0,0,0,0,0,0,0,0,0,0,0,0,0,0,0,0,0,0,"OK","OK","OK","OK"]
["1. Chirurgie dento-alveolară",null,62,0,0,0,0,0,0,0,0,0,0,0,0,0,0,0,0,0,0,0,0,0,0,0,0,0,0,0,"OK","OK","OK","OK"]
["2. Ortodonţie şi ortopedie dento-facială",null,63,0,0,0,0,0,0,0,0,0,0,0,0,0,0,0,0,0,0,0,0,0,0,0,0,0,0,0,"OK","OK","OK","OK"]
["III. FARMACIŞTI – TOTAL,              din care:",null,64,0,0,0,0,0,0,0,0,0,0,0,0,0,0,0,0,0,0,0,0,0,0,0,0,0,0,0,"OK","OK","OK","OK"]
["          - rezidenţi",null,65,0,0,0,0,0,0,0,0,0,0,0,0,0,0,0,0,0,0,0,0,0,0,0,0,0,0,0,"OK","OK","OK","OK"]
["1. Farmacie clinică",null,66,0,0,0,0,0,0,0,0,0,0,0,0,0,0,0,0,0,0,0,0,0,0,0,0,0,0,0,"OK","OK","OK","OK"]
["2. Laborator farmaceutic",null,67,0,0,0,0,0,0,0,0,0,0,0,0,0,0,0,0,0,0,0,0,0,0,0,0,0,0,0,"OK","OK","OK","OK"]
["IV. FIZIOKINETOTERAPEUŢI (fiziokinetoterapeuți, kinetoterapeuți, fizioterapeuți, profesori CFM) - TOTAL, din care:",null,68,0,0,0,0,0,0,0,0,0,0,0,0,0,0,0,0,0,0,0,0,0,0,0,0,0,0,0,"OK","OK","OK","OK"]
["          - fizioterapeuţi  ",null,69,0,0,0,0,0,0,0,0,0,0,0,0,0,0,0,0,0,0,0,0,0,0,0,0,0,0,0,"OK","OK","OK","OK"]
["V. ASISTENŢI MEDICALI CU STUDII SUPERIOARE - TOTAL,       din care:",null,70,0,0,0,0,0,0,0,0,0,0,0,0,0,0,0,0,0,0,0,0,0,0,0,0,0,0,0,"OK","OK","OK","OK"]
["       - asistenţi medicali obstetrică- ginecologie (moaşe)",null,71,{"$f":"+E262+F262","v":0},{"$f":"+H262+K262+N262+Q262+T262+W262","v":0},0,0,{"$f":"+G262-I262","v":0},0,0,{"$f":"+J262-L262","v":0},0,0,{"$f":"+M262-O262","v":0},0,0,{"$f":"+P262-R262","v":0},0,0,{"$f":"+S262-U262","v":0},0,0,{"$f":"+V262-X262","v":0},0,0,{"$f":"+Y262-AA262","v":0},0,0,{"$f":"+AB262-AD262","v":0},0,"OK","OK","OK","OK"]
["VI. ALT PERSONAL SANITAR SUPERIOR (biologi, chimişti, logopezi, psihologi) - TOTAL, din care:",null,72,{"$f":"+E263+F263","v":0},0,0,0,{"$f":"+G263-I263","v":0},0,0,{"$f":"+J263-L263","v":0},0,0,{"$f":"+M263-O263","v":0},0,0,{"$f":"+P263-R263","v":0},0,0,{"$f":"+S263-U263","v":0},0,0,{"$f":"+V263-X263","v":0},0,0,{"$f":"+Y263-AA263","v":0},0,0,{"$f":"+AB263-AD263","v":0},0,"OK","OK","OK","OK"]
["       - psihologi",null,73,{"$f":"+E264+F264","v":0},{"$f":"+H264+K264+N264+Q264+T264+W264","v":0},{"$f":"+I264+L264+O264+R264+U264+X264","v":0},0,{"$f":"+G264-I264","v":0},0,0,{"$f":"+J264-L264","v":0},0,0,{"$f":"+M264-O264","v":0},0,0,{"$f":"+P264-R264","v":0},0,0,{"$f":"+S264-U264","v":0},0,0,{"$f":"+V264-X264","v":0},0,0,{"$f":"+Y264-AA264","v":0},0,0,{"$f":"+AB264-AD264","v":0},0,{"$f":"IF((E264>=Z264),\"OK\",\"Err\")","v":"OK"},{"$f":"IF((F264>=AA264),\"OK\",\"Err\")","v":"OK"},{"$f":"IF((Z264>=AC264),\"OK\",\"Err\")","v":"OK"},{"$f":"IF((AA264>=AD264),\"OK\",\"Err\")","v":"OK"}]
["VII. ALT PERSONAL CU STUDII SUPERIOARE (economişti,jurişti, ingineri etc.)",null,74,{"$f":"+E265+F265","v":0},0,0,0,{"$f":"+G265-I265","v":0},0,0,{"$f":"+J265-L265","v":0},0,0,{"$f":"+M265-O265","v":0},0,0,{"$f":"+P265-R265","v":0},0,0,{"$f":"+S265-U265","v":0},0,0,{"$f":"+V265-X265","v":0},0,0,{"$f":"+Y265-AA265","v":0},0,0,{"$f":"+AB265-AD265","v":0},0,"OK","OK","OK","OK"]

{"sheet":"Laboratoare_sali_operatie","index":13,"n_rows":82,"n_cols":6,"rows_kept":82,"cut":false,"hidden":false,"merged":[]}
["LABORATOARE MEDICALE"]
[]
["Specialitatea laboratorului","Rând","Total","Urban","Rural"]
["A","B",1,2,3]
["Total,             din care:",1,{"$f":"+C6+C19+C23+C24+C25+C26+C27+C28+C29","v":0},{"$f":"+D6+D19+D23+D24+D25+D26+D27+D28+D29","v":0},{"$f":"+E6+E19+E23+E24+E25+E26+E27+E28+E29","v":0}]
["Analize medicale,    din care:",2,{"$f":"SUM(D6:E6)","v":0},0,0,{"$f":"IF(AND(C6<=SUM(C7:C10,C16:C18), NOT(AND(C6=0, SUM(C7:C10,C16:C18)>0))), \"OK\", \"ERR\")","v":"OK"}]
["    -  Biochimie",3,0,0,0]
["    -  Hematologie",4,0,0,0]
["    -  Alergologie şi imunologie",5,0,0,0]
["    -  Microbiologie,   din care:",6,0,0,0,{"$f":"IF(AND(C10<=SUM(C11:C15), NOT(AND(C10=0, SUM(C11:C15)>0))), \"OK\", \"ERR\")","v":"OK"}]
["                 -  bacteriologie",7,0,0,0]
["                 -  bacteriologie BK",8,0,0,0]
["                 -  virusologie",9,0,0,0]
["                 -  micologie",10,0,0,0]
["                 -  parazitologie",11,0,0,0]
["    -  Diagnostic molecular",12,0,0,0]
["    -  Genetică",13,0,0,0]
["    -  Toxicologie",14,0,0,0]
["Anatomie patologică, din care:",15,0,0,0,{"$f":"IF(AND(C19<=SUM(C20:C22), NOT(AND(C19=0, SUM(C20:C22)>0))), \"OK\", \"ERR\")","v":"OK"}]
["     -  Histopatologie",16,0,0,0]
["     -  Citologie",17,0,0,0]
["     -  Prosectura",18,0,0,0]
["Diagnostic cu ultrasunete",19,0,0,0]
["Explorări funcţionale",20,0,0,0]
["Medicină nucleară",21,0,0,0]
["Radiologie şi imagistică medicală",22,0,0,0]
["Radioterapie",23,0,0,0]
["Recuperare, medicină fizică şi balneologie",24,0,0,0]
["Alte (aici se raportează și infecțiile asociate asistenței medicale)",25,0,0,0]
[]
["NUMĂR SĂLI DE OPERAȚIE ÎN SPITAL"]
[]
["Denumirea secţiei/ compartimentului","Rând","Total","Urban","Rural"]
["TOTAL           din care:",1,{"$f":"SUM(C35:C82)","v":0},{"$f":"SUM(D35:D82)","v":0},{"$f":"SUM(E35:E82)","v":0}]
["A.T.I.",2,{"$f":"SUM(D35:E35)","v":0},0,0]
["Boli infecţioase",3,0,0,0]
["Boli profesionale",4,0,0,0]
["Cardiologie",5,0,0,0]
["Chirurgie generală",6,0,0,0]
["Chirurgie infantilă",7,0,0,0]
["Chirurgie cardiovasculară",8,0,0,0]
["Chirurgie toracică",9,0,0,0]
["Chirurgie toracică -tbc",10,0,0,0]
["Chirurgie maxilo-facială",11,0,0,0]
["Chirurgie plastică şi reparatorie (arşi)",12,0,0,0]
["Cronici",13,0,0,0]
["Dermato-venerice",14,0,0,0]
["Diabet, boli de nutriţie",15,0,0,0]
["Endocrinologie",16,0,0,0]
["Imunologie şi alergologie",17,0,0,0]
["Gastroenterologie",18,0,0,0]
["Geriatrie şi gerontologie",19,0,0,0]
["Ginecologie",20,0,0,0]
["Hematologie",21,0,0,0]
["Medicină generală",22,0,0,0]
["Medicină fizică şi balneologie",23,0,0,0]
["Medicină internă",24,0,0,0]
["Nefrologie",25,0,0,0]
["Neurochirurgie",26,0,0,0]
["Neurologie",27,0,0,0]
["Neonatologie şi prematuri",28,0,0,0]
["Obstetrică",29,0,0,0]
["Obstetrică-ginecologie",30,0,0,0]
["Oftalmologie",31,0,0,0]
["Oncologie medicală",32,0,0,0]
["O.R.L.",33,0,0,0]
["Ortopedie şi traumatologie",34,0,0,0]
["Pediatrie",35,0,0,0]
["Pneumologie",36,0,0,0]
["Pneumologie -tbc",37,0,0,0]
["Psihiatrie",38,0,0,0]
["Psihiatrie acuţi",39,0,0,0]
["Psihiatrie cronici",40,0,0,0]
["Recuperare medicală",41,0,0,0]
["Rec. neuro-psiho-motorie",42,0,0,0]
["Recuperare pediatrică",43,0,0,0]
["Reumatologie",44,0,0,0]
["Tbc osteoarticular",45,0,0,0]
["Toxicologie",46,0,0,0]
["Urologie",47,0,0,0]
["Alte",48,0,0,0]
[null,49,0,0,0]

{"sheet":"Mama","index":14,"n_rows":303,"n_cols":5,"rows_kept":303,"cut":false,"hidden":true,"merged":[]}
["AdresaC14","Denumirea_Sectiei_mama se aduna toata","Ce subsectii se scad care au mama B separate prin |","Se aduna Subsectii a caror mama este diferita de mama din B separate prin |","se aduna SECTII curate se aduna la A"]
["C27","ATI_|ATI_COPII_","ATI_TOXICOLOGIE","ATI|ATI_COPII","ATI_UROLOGIE"]
["D27","ATI_COVID_"]
["E27","ATI_COVID_COPII"]
["F27","BOLI_INFECŢIOASE_|BOLI_INFECTIOASE_SI_TROPICALE|BOLI_INFECTIOASE_COPII_|BOLI_INFECTIOASE_HIV_SIDA_|BOLI_INFECTIOASE_CRONICI_HIV_SIDA","INGRIJIRI_PALIATIVE|CRONICI|BOLI_CRONICE|DERMATOVENEROLOGIE","HIV_SIDA|BOLI_INFECTIOASE_COPII","BOLI_INFECTIOASE_MAPN|HIV_SIDA"]
["G27","BOLI_PROFESIONALE",null,"BOLI_PROFESIONALE"]
["H27","CARDIOLOGIE_|CARDIOLOGIE_PEDIATRICA_","RECUPERARE_CARDIOLOGIE|RECUPERARE_MEDICALA_CARDIOVASCULARA|GENETICA_MEDICALA","CARDIOLOGIE|TI_CORONARIENI","CARDIOLOGIE_CRONICI|CARDIOLOGIE_INTERVENTIONALA|CARDIOLOGIE_PATOLOGIE_STABILIZATA_SI_CRONICA|CARDIOLOGIE_PENTRU_DIABETICI"]
["I27","CHIRURGIE_CARDIOVASCULARA_|CHIRURGIE_CARDIOVASCULARA_ADULTI_SI_COPII","ATI_COPII|ATI|CHIRURGIE_TORACICA|CHIRURGIE_VASCULARA","CHIRURGIE_CARDIOVASCULARA","CHIRURGIE_CARDIACA_SI_A_VASELOR_MARI"]
["J27","CHIRURGIE_GENERALA_|CHIRURGIE_VASCULARA|ORL_MICROCHIRURGIE_OTOLOGICA|CHIRURGIE_ONCOLOGICA_","ARSI|ATI|CHIRURGIE_MAXILO_FACIALA|CHIRURGIE_ORALA_SI_MAXILO_FACIALA|CHIRURGIE_PEDIATRICA|CHIRURGIE_PLASTICA_MICROCHIRURGIE_RECONSTRUCTIVA|CHIRURGIE_SI_ORTOPEDIE_INFANTILA_PEDIATRICA|CHIRURGIE_TORACICA|CHIRURGIE_TORACICA_SI_ESOFAGIANA|CRONICI|NEUROCHIRURGIE|OBSTETRICA_GINECOLOGIE|OFTALMOLOGIE|ORL|ORTOPEDIE_SI_TRAUMATOLOGIE|UROLOGIE|GINECOLOGIE|GINECO_ONCOLOGIE|CHIRURGIE_CARDIOVASCULARA|NEONATOLOGIE|IMPLANT_COHLEAR|CHIRURGIE_ONCOLOGICA_COPII","CHIRURGIE_ARTROSCOPICA|CHIRURGIE_SPINALA|CHIRURGIE_LAPAROSCOPICA_GINECOLOGICA|CHIRURGIE_VASCULARA|CHIRURGIE_ONCOLOGICA","CHIRURGIE_ENDOCRINA|CHIRURGIE_LAPAROSCOPICA_|CHIRURGIE_ONCOLOGICA_ORL_CHIRURGIE_CERVICO_FACIALA_SI_ONCOLOGIE_LARINGIANA|ORL_CHIRURGIE_AUDIOLOGICA_SI_RINOLOGICA|ORL_MICROCHIRURGIE_ORL_SI_FONIATRIE_RECUPERAREA_VOCII"]
["K27","CHIRURGIE_ORALA_SI_MAXILO_FACIALA_","ATI|CHIRURGIE_PLASTICA_MICROCHIRURGIE_RECONSTRUCTIVA|CHIRURGIE_PLASTICA_SI_REPARATORIE_FACIALA|ORL","CHIRURGIE_MAXILO_FACIALA|CHIRURGIE_ORALA_SI_MAXILO_FACIALA"]
["L27","CHIRURGIE_PEDIATRICA_","ATI|CHIRURGIE_CARDIOVASCULARA|NEUROCHIRURGIE|OFTALMOLOGIE|ORL|ORTOPEDIE_PEDIATRICA|UROLOGIE|ARSI_COPII|CHIRURGIE_ORALA_SI_MAXILO_FACIALA|CHIRURGIE_PLASTICA_MICROCHIRURGIE_RECONSTRUCTIVA_SI_ARSI|CHIRURGIE_PLASTICA_MICROCHIRURGIE_RECONSTRUCTIVA|UROLOGIE_COPII","CHIRURGIE_PEDIATRICA|CHIRURGIE_SI_ORTOPEDIE_INFANTILA_PEDIATRICA|CHIRURGIE_ONCOLOGICA_COPII","CHIRURGIE_SI_ORTOPEDIE_INFANTILA_PEDIATRICA"]
["M27","CHIRURGIE_PLASTICA_MICROCHIRURGIE_RECONSTRUCTIVA|UNITATE_ARSI_GRAV|UNITATE_DE_INGRIJIRE_ARSI_GRAV|CHIRURGIE_PLASTICA_MICROCHIRURGIE_RECONSTRUCTIVA_ARSI_|CHIRURGIE_PLASTICA_MICROCHIRURGIE_RECONSTRUCTIVA_COPII_","ATI","CHIRURGIE_PLASTICA_MICROCHIRURGIE_RECONSTRUCTIVA|ARSI|ARSI_COPII|CHIRURGIE_PLASTICA_SI_REPARATORIE_FACIALA|CHIRURGIE_PLASTICA_MICROCHIRURGIE_RECONSTRUCTIVA_SI_ARSI"]
["N27","CHIRURGIE_TORACICA","ATI","CHIRURGIE_TORACICA|CHIRURGIE_TORACICA_SI_ESOFAGIANA"]
["O27","CHIRURGIE_TORACICA_TBC","ATI"]
["P27","BOLI_CRONICE|CRONICI_AFECTIUNI_PSIHOSOMATICE|CRONICI_","INGRIJIRI_PALIATIVE|GERIATRIE_SI_GERONTOLOGIE|RECUPERARE_NEUROLOGICA|REUMATOLOGIE_","CRONICI|BOLI_CRONICE"]
["Q27","DERMATOVENEROLOGIE_|BOLI_PARAZITARE","ALERGOLOGIE_SI_IMUNOLOGIE|BOLI_CRONICE","DERMATOVENEROLOGIE","DERMATOVENEROLOGIE_COPII_"]
["R27","DIABET_ZAHARAT_NUTRITIE_SI_BOLI_METABOLICE_","DERMATOVENEROLOGIE|ENDOCRINOLOGIE|MEDICINA_INTERNA|HEMATOLOGIE","DIABET_ZAHARAT_NUTRITIE_SI_BOLI_METABOLICE|DIABET_ZAHARAT_NUTRITIE_SI_BOLI_METABOLICE_COPII","DIABET_ZAHARAT_NUTRITIE_SI_BOLI_METABOLICE_COPII"]
["S27","ENDOCRINOLOGIE_","DIABET_ZAHARAT_NUTRITIE_SI_BOLI_METABOLICE|ONCOLOGIE_MEDICALA","ENDOCRINOLOGIE|ENDOCRINOLOGIE_COPII","ENDOCRINOLOGIE_COPII_"]
["T27","GASTROENTEROLOGIE_","ONCOLOGIE_DIGESTIVA|MEDICINA_INTERNA|ONCOLOGIE_MEDICALA|DIABET_ZAHARAT_NUTRITIE_SI_BOLI_METABOLICE|ENDOCRINOLOGIE|DIABET_ZAHARAT_NUTRITIE_SI_BOLI_METABOLICE_COPII|ENDOCRINOLOGIE_COPII","GASTROENTEROLOGIE","GASTROENTEROLOGIE_COPII_|GASTROENTEROLOGIE_HEPATOLOGIE"]
["U27","GERIATRIE_SI_GERONTOLOGIE_","PSIHOGERIATRIE","GERIATRIE_SI_GERONTOLOGIE"]
["V27","GINECOLOGIE_","CHIRURGIE_LAPAROSCOPICA_GINECOLOGICA","GINECOLOGIE|GINECO_ONCOLOGIE","GINECOLOGIE_INFANTILA"]
["W27","HEMATOLOGIE_|HEMATOLOGIE_HEMOFILIE",null,"HEMATOLOGIE_THALASEMII|HEMATOLOGIE"]
["X27","ALERGOLOGIE_SI_IMUNOLOGIE",null,"ALERGOLOGIE_SI_IMUNOLOGIE"]
["A36","MEDICINA_GENERALA"]
["B36","MEDICINA_INTERNA_|PNEUMOLOGIE_DIN_SECTIILE_MEDICALE","ALERGOLOGIE_SI_IMUNOLOGIE|BOLI_PROFESIONALE|CARDIOLOGIE|CRONICI|DERMATOVENEROLOGIE|DIABET_ZAHARAT_NUTRITIE_SI_BOLI_METABOLICE|DIALIZA_PERITONEALA|ENDOCRINOLOGIE|GASTROENTEROLOGIE|GERIATRIE_SI_GERONTOLOGIE|HEMATOLOGIE|NEFROLOGIE|NEUROLOGIE|ONCOLOGIE_MEDICALA|RECUPERARE_MEDICINA_FIZICA_SI_BALNEOLOGIE|REUMATOLOGIE|INGRIJIRI_PALIATIVE|RECUPERARE_MEDICALA_RESPIRATORIE|TI_CORONARIENI|NEUROLOGIE_CRONICI|RECUPERARE_MEDICALA|RECUPERARE_RESPIRATORIE","MEDICINA_INTERNA","MEDICINA_INTERNA_CRONICI|PNEUMOLOGIE_DIN_SECTIILE_MEDICALE_CRONICI"]
["C36","NEFROLOGIE_|NEFROLOGIE_PEDIATRICA|NEFROLOGIE_PENTRU_DIABETICI|PEDIATRIE_NEFROLOGIE|DIALIZA_PERITONEALA","MEDICINA_INTERNA|TOXICOLOGIE|ALERGOLOGIE_SI_IMUNOLOGIE|CRONICI","NEFROLOGIE|DIALIZA_PERITONEALA"]
["D36","NEONATOLOGIE_|NEONATOLOGIE_PREMATURI|PREMATURI_",null,"NEONATOLOGIE|PREMATURI|NEONATOLOGIE_DIN_SECTIILE_DE_PEDIATRIE|NEONATOLOGIE_PATOLOGICA_DIN_SECTIILE_DE_PEDIATRIE|PREMATURI_DIN_SECTIILE_DE_PEDIATRIE"]
["E36","NEUROCHIRURGIE_","ATI|CHIRURGIE_SPINALA|CRONICI","NEUROCHIRURGIE","NEUROCHIRURGIE_STEREOTACTICA_SI_FUNCTIONALA"]
["F36","NEUROLOGIE_|NEUROLOGIE_PEDIATRICA|UNITATE_DE_URGENTE_NEUROVASCULARE","CRONICI|RECUPERARE_CRONICI|RECUPERARE_NEUROLOGICA|RECUPERARE_NEUROMOTORIE|RECUPERARE_NEUROPSIHOMOTORIE|TOXICOLOGIE|RECUPERARE_NEUROLOGICA_PEDIATRICA|PSIHIATRIE_PEDIATRICA","NEUROLOGIE_PEDIATRICA|NEUROLOGIE|NEUROLOGIE_CRONICI","NEUROLOGIE_CRONICI|NEUROLOGIE_SI_PSIHIATRIE"]
["G36","OBSTETRICA_|OBSTETRICA_PATOLOGICA",null,"OBSTETRICA|OBSTETRICA_PATOLOGICA|OBSTETRICA_PATOLOGICA_CRONICI","OBSTETRICA_FIZIOLOGICA"]
["H36","OBSTETRICA_GINECOLOGIE_|MEDICINA_MATERNO_FETALA","ATI|GINECOLOGIE|GINECO_ONCOLOGIE|NEONATOLOGIE|OBSTETRICA|OBSTETRICA_PATOLOGICA|PREMATURI|GENETICA_MEDICALA|BOLI_CRONICE|CHIRURGIE_ONCOLOGICA|URO_GINECOLOGIE|OBSTETRICA_PATOLOGICA_CRONICI","OBSTETRICA_GINECOLOGIE","OBSTETRICA_GINECOLOGIE_GRAVIDE_CU_RISC|OBSTETRICA_GINECOLOGIE_PATOLOGICA|OBSTETRICA_GINECOLOGIE_NASTERI_PRECIPITATE"]
["I36","OFTALMOLOGIE_","ATI","OFTALMOLOGIE","OFTALMOLOGIE_COPII_"]
["J36","ONCOLOGIE_MEDICALA_|ONCOLOGIE_TERAPIE_CU_IZOTOPI|RADIOTERAPIE_|RADIOTERAPIE_M_AP_N|ONCOLOGIE_PEDIATRICA|TERAPIE_CU_IZOTOPI","HEMATOLOGIE|INGRIJIRI_PALIATIVE|CRONICI","ONCOLOGIE_MEDICALA|HEMATOLOGIE_ONCOLOGIE|ONCOLOGIE_PEDIATRICA|ONCOLOGIE_DIGESTIVA","ONCOLOGIE_PEDIATRICA|CRONICI_TERAPIE_IZOTOPICA|HEMATOLOGIE_ONCOLOGIE_PEDIATRICA|RADIOTERAPIE_CRONICI"]
["K36","ORL","ATI|CHIRURGIE_MAXILO_FACIALA|CHIRURGIE_ORALA_SI_MAXILO_FACIALA","ORL|IMPLANT_COHLEAR","ORL_COPII_"]
["L36","ORTOPEDIE_SI_TRAUMATOLOGIE_","ATI|CHIRURGIE_ARTROSCOPICA|CHIRURGIE_SPINALA|RECUPERARE_CRONICI|RECUPERARE_MEDICALA|RECUPERARE_POSTTRAUMATICA|CHIRURGIE_SI_ORTOPEDIE_INFANTILA_PEDIATRICA|RECUPERARE_MEDICALA_ORTOPEDIE_SI_TRAUMATOLOGIE|RECUPERARE_MEDICALA_ORTOPEDIE_SI_TRAUMATOLOGIE_PEDIATRICA|NEUROCHIRURGIE","ORTOPEDIE_SI_TRAUMATOLOGIE|ORTOPEDIE_PEDIATRICA","ORTOPEDIE_PEDIATRICA_"]
["M36","PEDIATRIE_|PNEUMOLOGIE_DIN_SECTIILE_MEDICALE_COPII","ALERGOLOGIE_SI_IMUNOLOGIE|BOLI_INFECTIOASE_COPII|CARDIOLOGIE|CRONICI|DERMATOVENEROLOGIE|DIABET_ZAHARAT_NUTRITIE_SI_BOLI_METABOLICE|DIALIZA_PERITONEALA|ENDOCRINOLOGIE|GASTROENTEROLOGIE|GENETICA_MEDICALA|HEMATOLOGIE_ONCOLOGIE|HEMATOLOGIE_THALASEMII|HEMATOLOGIE|HIV_SIDA|NEFROLOGIE|NEONATOLOGIE_DIN_SECTIILE_DE_PEDIATRIE|NEONATOLOGIE_PATOLOGICA_DIN_SECTIILE_DE_PEDIATRIE|NEUROLOGIE_PEDIATRICA|NEUROPSIHIATRIE_INFANTILA|ONCOLOGIE_PEDIATRICA|PREMATURI_DIN_SECTIILE_DE_PEDIATRIE|PSIHIATRIE_PEDIATRICA|RECUPERARE_NEUROMOTORIE|RECUPERARE_NUTRITIONALA_SI_METABOLICA_A_SUGARULUI_SI_COPILULUI_MIC|RECUPERARE_PEDIATRICA_DISTROFICI|TOXICOLOGIE|REUMATOLOGIE|RECUPERARE_PEDIATRICA|INGRIJIRI_PALIATIVE","PEDIATRIE_CRONICI","PEDIATRIE_CRONICI"]
["N36","PNEUMOLOGIE_DIN_SECTIILE_TBC_|PNEUMOLOGIE_DIN_SECTIILE_TBC_COPII_","PNEUMOLOGIE_TBC|PNEUMOLOGIE_TBC_COPII|PNEUMOLOGIE_TBC_CRONICI|PNEUMOLOGIE_TBC_MDR_MULTIDROG_REZISTENTA|RECUPERARE_MEDICALA_RESPIRATORIE|CRONICI|PNEUMOLOGIE_TBC_ADULTI|BOLI_INFECTIOASE_COPII",null,"PNEUMOLOGIE_DIN_SECTIILE_TBC_CRONICI_|PNEUMOLOGIE_COPII_DIN_SECTIILE_TBC_"]
["O36","PNEUMOLOGIE_TBC_|PNEUMOLOGIE_TBC_MDR_MULTIDROG_REZISTENTA_",null,"PNEUMOLOGIE_TBC|PNEUMOLOGIE_TBC_COPII|PNEUMOLOGIE_TBC_CRONICI|PNEUMOLOGIE_TBC_MDR_MULTIDROG_REZISTENTA|PNEUMOLOGIE_TBC_ADULTI","PNEUMOLOGIE_TBC_COPII_|PNEUMOLOGIE_TBC_CRONICI_|PNEUMOLOGIE_TBC_MDR_MULTIDROG_REZISTENTA_\n"]
["P36","PSIHIATRIE_","BOLNAVI_PSIHICI_CU_TBC_PULMONAR_COD_PENAL|COD_PENAL|CRONICI_TERAPIE_OCUPATIONALA_SI_REABILITARE|PSIHIATRIE_ACUTI|PSIHIATRIE_CRONICI|RECUPERARE_CRONICI|POSTCURA_POLITOXICOMANIE_SI_ADICTII|POSTCURA_TOXICOMANIE|INGRIJIRI_PALIATIVE|RECUPERARE_NEUROPSIHOMOTORIE_COPII|PSIHIATRIE_CRONICI|NEUROLOGIE_PEDIATRICA|TOXICOMANIE_DEZINTOXICARE|COPII_ART_110_COD_PENAL","PSIHIATRIE_PEDIATRICA|NEUROPSIHIATRIE_INFANTILA|PSIHOGERIATRIE|PSIHIATRIE|PSIHIATRIE_PEDIATRICA_COPII","NEUROPSIHIATRIE_ADULTI|NEUROPSIHIATRIE_INFANTILA|PSIHIATRIE_PSIHOSOMATICA|PSIHIATRIE_PSIHOZE|PSIHIATRIE_GERONTOPSIHIATRIE|PSIHIATRIE_PEDIATRICA_COPII"]
["Q36","PSIHIATRIE_ACUTI_|TOXICOMANIE|PSIHIATRIE_DROGODEPENDENTA","COD_PENAL|NEUROPSIHIATRIE_INFANTILA|PSIHIATRIE|PSIHIATRIE_CRONICI|INGRIJIRI_PALIATIVE","POSTCURA_POLITOXICOMANIE_SI_ADICTII|POSTCURA_TOXICOMANIE|TOXICOMANIE_DEZINTOXICARE|PSIHIATRIE_ACUTI|TOXICOMANIE","PSIHIATRIE_TOXICOMANIE_|TOXICOMANIE_ELEVI_SI_STUDENTI"]
["R36","PSIHIATRIE_CRONICI_","PSIHIATRIE_ACUTI|PSIHIATRIE_PEDIATRICA_COPII|PSIHIATRIE|INGRIJIRI_PALIATIVE|TOXICOMANIE","COD_PENAL|BOLNAVI_PSIHICI_CU_TBC_PULMONAR_COD_PENAL|CRONICI_TERAPIE_OCUPATIONALA_SI_REABILITARE|PSIHIATRIE_CRONICI|COPII_ART_110_COD_PENAL","PSIHIATRIE_CRONICI_COPII"]
["S36","RECUPERARE_MEDICALA|RECUPERARE_MEDICALA_CARDIOVASCULARA|RECUPERARE_MEDICALA_CRONICI_DIABET_SI_HEMOFILIE||RECUPERARE_MEDICALA_ORTOPEDIE_SI_TRAUMATOLOGIE_|RECUPERARE_MEDICALA_RESPIRATORIE_|RECUPERARE_CARDIOLOGIE_COPII|RECUPERARE_BOLI_CARDIOVASCULARE_|RECUPERARE_NEUROMOTORIE_COPII_|RECUPERARE_NEUROMOTORIE|RECUPERARE_NEUROLOGICA_|RECUPERARE_NEUROLOGICA_COPII|RECUPERARE_NEUROLOGICA_CRONICI_|RECUPERARE_NEUROMUSCULARA|RECUPERARE_ORTOPEDIE_SI_TRAUMATOLOGIE","TI_CORONARIENI|CHIRURGIE_SI_ORTOPEDIE_INFANTILA_PEDIATRICA|NEUROLOGIE","RECUPERARE_CRONICI|RECUPERARE_NEUROLOGICA|RECUPERARE_NEUROMOTORIE|RECUPERARE_BOLI_CARDIOVASCULARE|RECUPERARE_BOLI_RESPIRATORII|RECUPERARE_NEUROMOTORIE_COPII|RECUPERARE_ORTOPEDIE_SI_TRAUMATOLOGIE|RECUPERARE_POSTTRAUMATICA|RECUPERARE_REUMATOLOGICA|RECUPERARE_CARDIOLOGIE|RECUPERARE_MEDICALA|RECUPERARE_MEDICALA_RESPIRATORIE|RECUPERARE_MEDICALA_ORTOPEDIE_SI_TRAUMATOLOGIE|RECUPERARE_MEDICALA_CARDIOVASCULARA|RECUPERARE_RESPIRATORIE|RECUPERARE_NEUROLOGIE_COPII","RECUPERARE_ORL_COPII_CU_HANDICAP_AUZ_VORBIRE_CIUBOTICA_CUCULUI|RECUPERARE_TRAUMATOLOGICA_VERTEBROMEDULARA_SI_NEUROMOTORIE"]
["T36","RECUPERARE_NEUROPSIHOMOTORIE|RECUPERARE_MEDICALA_NEUROPSIHOMOTORIE_COPII|RECUPERARE_NEUROPSIHOMOTORIE_COPII","RECUPERARE_NEUROLOGIE_COPII","RECUPERARE_NEUROPSIHOMOTORIE|RECUPERARE_NEUROPSIHOMOTORIE_COPII|RECUPERARE_MEDICALA_NEUROPSIHOMOTORIE","RECUPERARE_NEUROPSIHOMOTORIE_SI_POSTTRAUMATICA_COPII"]
["U36","RECUPERARE_PEDIATRICA_DISTROFICI|PEDIATRIE_RECUPERARE_PEDIATRICA","PEDIATRIE_CRONICI","RECUPERARE_NUTRITIONALA_SI_METABOLICA_A_SUGARULUI_SI_COPILULUI_MIC|RECUPERARE_PEDIATRICA_DISTROFICI|RECUPERARE_PEDIATRICA|RECUPERARE_NEUROLOGICA_PEDIATRICA|RECUPERARE_MEDICALA_ORTOPEDIE_SI_TRAUMATOLOGIE_PEDIATRICA"]
["V36","RECUPERARE_MEDICINA_FIZICA_SI_BALNEOLOGIE_|RECUPERARE_MEDICINA_FIZICA_SI_BALNEOLOGIE_COPII_","RECUPERARE_BOLI_CARDIOVASCULARE|RECUPERARE_BOLI_RESPIRATORII|RECUPERARE_NEUROLOGICA|RECUPERARE_NEUROMOTORIE_COPII|RECUPERARE_ORTOPEDIE_SI_TRAUMATOLOGIE|RECUPERARE_POSTTRAUMATICA|RECUPERARE_REUMATOLOGICA|REUMATOLOGIE|RECUPERARE_MEDICALA_NEUROPSIHOMOTORIE\n","RECUPERARE_MEDICINA_FIZICA_SI_BALNEOLOGIE"]
["W36","REUMATOLOGIE_","RECUPERARE_MEDICINA_FIZICA_SI_BALNEOLOGIE","REUMATOLOGIE"]
["X36","TBC_OSTEOARTICULAR"]
["A45","TOXICOLOGIE_",null,"ATI_TOXICOLOGIE|TOXICOLOGIE","TERAPIE_INTENSIVA_TOXICOLOGIE"]
["B45","UROLOGIE_","ATI","UROLOGIE|UROLOGIE_COPII|URO_GINECOLOGIE"]
["C45","INGRIJIRI_PALIATIVE|INGRIJIRI_PALIATIVE_COPII|ONCOLOGIE_MEDICALA_INGRIJIRI_PALIATIVE_|PNEUMOLOGIE",null,"INGRIJIRI_PALIATIVE"]
["D45","PATURI PENTRU PACIENTI COVID_"]
["E45","PATURI PENTRU PACIENTI COVID_COPII_"]
["F45","GENETICA_MEDICALA",null,"GENETICA_MEDICALA"]
[]
[]
[]
[]
[]
[]
[]
[]
[]
[]
[]
[]
[]
[]
[]
[]
[]
[]
[]
[]
[]
[]
[]
[]
[]
[]
[]
[]
[]
[]
[]
[]
[]
[]
[]
[]
[]
[]
[]
[]
[]
[]
[]
[]
[]
[]
["Denumirea sectiei (o singura sectie) din copac","Denumirea subsectiilor care raman pe loc separate intre ele cu |","unde apare","celula din C14"]
["ALERGOLOGIE_SI_IMUNOLOGIE","ALERGOLOGIE_SI_IMUNOLOGIE_COPII","B","X27"]
["ATI_1","ATI_ARSI|ATI_CHIRURGIE_CARDIOVASCULARA|ATI_CHIRURGIE_GENERALA|ATI_CHIRURGIE_PLASTICA|ATI_COPII|ATI_NEUROCHIRURGIE|ATI_NOU_NASCUTI_DIN_PEDIATRIE|ATI_OBSTETRICA_GINECOLOGIE|ATI_OFTALMOLOGIE|ATI_ORL|ATI_ORL_SI_OFTALMOLOGIE|ATI_ORTOPEDIE_SI_TRAUMATOLOGIE|ATI_POLITRAUMATISME|TI_CORONARIENI|TI_HEPATOLOGIE|TI_NEONATOLOGIE|ATI_UROLOGIE","B","C27"]
["ATI_2","ATI_ARSI|ATI_CHIRURGIE_CARDIOVASCULARA|ATI_CHIRURGIE_GENERALA|ATI_CHIRURGIE_PLASTICA|ATI_COPII|ATI_NEUROCHIRURGIE|ATI_NOU_NASCUTI_DIN_PEDIATRIE|ATI_OBSTETRICA_GINECOLOGIE|ATI_OFTALMOLOGIE|ATI_ORL|ATI_ORL_SI_OFTALMOLOGIE|ATI_ORTOPEDIE_SI_TRAUMATOLOGIE|ATI_POLITRAUMATISME|TI_CORONARIENI|TI_HEPATOLOGIE|TI_NEONATOLOGIE|ATI_UROLOGIE","B","C27"]
["ATI_3","ATI_ARSI|ATI_CHIRURGIE_CARDIOVASCULARA|ATI_CHIRURGIE_GENERALA|ATI_CHIRURGIE_PLASTICA|ATI_COPII|ATI_NEUROCHIRURGIE|ATI_NOU_NASCUTI_DIN_PEDIATRIE|ATI_OBSTETRICA_GINECOLOGIE|ATI_OFTALMOLOGIE|ATI_ORL|ATI_ORL_SI_OFTALMOLOGIE|ATI_ORTOPEDIE_SI_TRAUMATOLOGIE|ATI_POLITRAUMATISME|TI_CORONARIENI|TI_HEPATOLOGIE|TI_NEONATOLOGIE|ATI_UROLOGIE","B","C27"]
["ATI_4","ATI_ARSI|ATI_CHIRURGIE_CARDIOVASCULARA|ATI_CHIRURGIE_GENERALA|ATI_CHIRURGIE_PLASTICA|ATI_COPII|ATI_NEUROCHIRURGIE|ATI_NOU_NASCUTI_DIN_PEDIATRIE|ATI_OBSTETRICA_GINECOLOGIE|ATI_OFTALMOLOGIE|ATI_ORL|ATI_ORL_SI_OFTALMOLOGIE|ATI_ORTOPEDIE_SI_TRAUMATOLOGIE|ATI_POLITRAUMATISME|TI_CORONARIENI|TI_HEPATOLOGIE|TI_NEONATOLOGIE|ATI_UROLOGIE","B","C27"]
["ATI_5","ATI_ARSI|ATI_CHIRURGIE_CARDIOVASCULARA|ATI_CHIRURGIE_GENERALA|ATI_CHIRURGIE_PLASTICA|ATI_COPII|ATI_NEUROCHIRURGIE|ATI_NOU_NASCUTI_DIN_PEDIATRIE|ATI_OBSTETRICA_GINECOLOGIE|ATI_OFTALMOLOGIE|ATI_ORL|ATI_ORL_SI_OFTALMOLOGIE|ATI_ORTOPEDIE_SI_TRAUMATOLOGIE|ATI_POLITRAUMATISME|TI_CORONARIENI|TI_HEPATOLOGIE|TI_NEONATOLOGIE|ATI_UROLOGIE","B","C27"]
["ATI_COPII_1","TI|TA_NEONATOLOGIE|ATI_CHIRURGIE_CARDIOVASCULARA","B","C27"]
["ATI_COPII_2","TI|TA_NEONATOLOGIE|ATI_CHIRURGIE_CARDIOVASCULARA","B","C27"]
["ATI_COPII_3","TI|TA_NEONATOLOGIE|ATI_CHIRURGIE_CARDIOVASCULARA","B","C27"]
["ATI_COPII_4","TI|TA_NEONATOLOGIE|ATI_CHIRURGIE_CARDIOVASCULARA","B","C27"]
["ATI_COPII_5","TI|TA_NEONATOLOGIE|ATI_CHIRURGIE_CARDIOVASCULARA","B","C27"]
["ATI_COPII_6","TI|TA_NEONATOLOGIE|ATI_CHIRURGIE_CARDIOVASCULARA","B","C27"]
["BOLI_INFECTIOASE_COPII_1","HIV_SIDA|TA|TI|HIV_SIDA_COPII","B","F27"]
["BOLI_INFECTIOASE_COPII_2","HIV_SIDA|TA|TI|HIV_SIDA_COPII","B","F27"]
["BOLI_INFECTIOASE_COPII_3","HIV_SIDA|TA|TI|HIV_SIDA_COPII","B","F27"]
["BOLI_INFECTIOASE_COPII_4","HIV_SIDA|TA|TI|HIV_SIDA_COPII","B","F27"]
["BOLI_INFECTIOASE_COPII_5","HIV_SIDA|TA|TI|HIV_SIDA_COPII","B","F27"]
["BOLI_INFECTIOASE_COPII_6","HIV_SIDA|TA|TI|HIV_SIDA_COPII","B","F27"]
["BOLI_INFECTIOASE_HIV_SIDA_1","BOLI_INFECTIOASE_COPII_HIV_SIDA","B","F27"]
["BOLI_INFECTIOASE_HIV_SIDA_2","BOLI_INFECTIOASE_COPII_HIV_SIDA","B","F27"]
["BOLI_INFECTIOASE_SI_TROPICALE","BOLI_INFECTIOASE_SI_TROPICALE_COPII|TI","B","F27"]
["BOLI_INFECŢIOASE_1","BOLI_INFECTIOASE_COPII|HIV_SIDA|PARAZITOLOGIE|TA|TI|HIV_SIDA_ADULTI|HIV_SIDA_COPII","B","F27"]
["BOLI_INFECŢIOASE_2","BOLI_INFECTIOASE_COPII|HIV_SIDA|PARAZITOLOGIE|TA|TI|HIV_SIDA_ADULTI|HIV_SIDA_COPII","B","F27"]
["BOLI_INFECŢIOASE_3","BOLI_INFECTIOASE_COPII|HIV_SIDA|PARAZITOLOGIE|TA|TI|HIV_SIDA_ADULTI|HIV_SIDA_COPII","B","F27"]
["BOLI_INFECŢIOASE_4","BOLI_INFECTIOASE_COPII|HIV_SIDA|PARAZITOLOGIE|TA|TI|HIV_SIDA_ADULTI|HIV_SIDA_COPII","B","F27"]
["BOLI_INFECŢIOASE_5","BOLI_INFECTIOASE_COPII|HIV_SIDA|PARAZITOLOGIE|TA|TI|HIV_SIDA_ADULTI|HIV_SIDA_COPII","B","F27"]
["BOLI_INFECŢIOASE_6","BOLI_INFECTIOASE_COPII|HIV_SIDA|PARAZITOLOGIE|TA|TI|HIV_SIDA_ADULTI|HIV_SIDA_COPII","B","F27"]
["BOLI_PROFESIONALE","RADIOPATOLOGIE","B","G27"]
["CARDIOLOGIE_1","CARDIOLOGIE_INTERVENTIONALA|CARDIOLOGIE_PEDIATRICA|PATOLOGIE_STABILIZATA_SI_CRONICA|TI_CORONARIENI|TI|USTAC|CARDIOLOGIE_INTERVENTIONALA_SI_ELECTROFIZIOLOGIE|CARDIOLOGIE_CRONICI","B","H27"]
["CARDIOLOGIE_2","CARDIOLOGIE_INTERVENTIONALA|CARDIOLOGIE_PEDIATRICA|PATOLOGIE_STABILIZATA_SI_CRONICA|TI_CORONARIENI|TI|USTAC|CARDIOLOGIE_INTERVENTIONALA_SI_ELECTROFIZIOLOGIE|CARDIOLOGIE_CRONICI","B","H27"]
["CARDIOLOGIE_3","CARDIOLOGIE_INTERVENTIONALA|CARDIOLOGIE_PEDIATRICA|PATOLOGIE_STABILIZATA_SI_CRONICA|TI_CORONARIENI|TI|USTAC|CARDIOLOGIE_INTERVENTIONALA_SI_ELECTROFIZIOLOGIE|CARDIOLOGIE_CRONICI","B","H27"]
["CARDIOLOGIE_4","CARDIOLOGIE_INTERVENTIONALA|CARDIOLOGIE_PEDIATRICA|PATOLOGIE_STABILIZATA_SI_CRONICA|TI_CORONARIENI|TI|USTAC|CARDIOLOGIE_INTERVENTIONALA_SI_ELECTROFIZIOLOGIE|CARDIOLOGIE_CRONICI","B","H27"]
["CARDIOLOGIE_PEDIATRICA_1","TI_CORONARIENI","B","H27"]
["CARDIOLOGIE_PEDIATRICA_2","TI_CORONARIENI","B","H27"]
["CARDIOLOGIE_PEDIATRICA_3","TI_CORONARIENI","B","H27"]
["CHIRURGIE_CARDIOVASCULARA_1","CHIRURGIE_CARDIOVASCULARA_COPII|TRANSPLANT","B","I27"]
["CHIRURGIE_CARDIOVASCULARA_2","CHIRURGIE_CARDIOVASCULARA_COPII|TRANSPLANT","B","I27"]
["CHIRURGIE_GENERALA_1","CHIRURGIE_ENDOSCOPICA|CHIRURGIE_HEPATICA|CHIRURGIE_LAPAROSCOPICA|CHIRURGIE_ONCOLOGICA_|CHIRURGIE_VASCULARA|FLEBOLOGIE|TRANSPLANT_HEPATIC|TERAPIE_INTERMEDIARA_INGRIJIRE_POSTOPERATORIE_TIIP|SPRIJIN_POLITRAUMA|CHIRURGIE_ONCOLOGIE_MULTIVISCERALA|TRANSPLANT_TESUTURI_COMPOZITE|HEMORAGII_DIGESTIVE_GASTROENTEROLOGIE_INTERVENTIONALA|CHIRURGIE_REPARATORIE_A_PICIORULUI_DIABETIC|CHIRURGIE_ONCOLOGICA_COPII","B","J27"]
["CHIRURGIE_GENERALA_2","CHIRURGIE_ENDOSCOPICA|CHIRURGIE_HEPATICA|CHIRURGIE_LAPAROSCOPICA|CHIRURGIE_ONCOLOGICA_|CHIRURGIE_VASCULARA|FLEBOLOGIE|TRANSPLANT_HEPATIC|TERAPIE_INTERMEDIARA_INGRIJIRE_POSTOPERATORIE_TIIP|SPRIJIN_POLITRAUMA|CHIRURGIE_ONCOLOGIE_MULTIVISCERALA|TRANSPLANT_TESUTURI_COMPOZITE|HEMORAGII_DIGESTIVE_GASTROENTEROLOGIE_INTERVENTIONALA|CHIRURGIE_REPARATORIE_A_PICIORULUI_DIABETIC|CHIRURGIE_ONCOLOGICA_COPII","B","J27"]
["CHIRURGIE_GENERALA_3","CHIRURGIE_ENDOSCOPICA|CHIRURGIE_HEPATICA|CHIRURGIE_LAPAROSCOPICA|CHIRURGIE_ONCOLOGICA_|CHIRURGIE_VASCULARA|FLEBOLOGIE|TRANSPLANT_HEPATIC|TERAPIE_INTERMEDIARA_INGRIJIRE_POSTOPERATORIE_TIIP|SPRIJIN_POLITRAUMA|CHIRURGIE_ONCOLOGIE_MULTIVISCERALA|TRANSPLANT_TESUTURI_COMPOZITE|HEMORAGII_DIGESTIVE_GASTROENTEROLOGIE_INTERVENTIONALA|CHIRURGIE_REPARATORIE_A_PICIORULUI_DIABETIC|CHIRURGIE_ONCOLOGICA_COPII","B","J27"]
["CHIRURGIE_GENERALA_4","CHIRURGIE_ENDOSCOPICA|CHIRURGIE_HEPATICA|CHIRURGIE_LAPAROSCOPICA|CHIRURGIE_ONCOLOGICA_|CHIRURGIE_VASCULARA|FLEBOLOGIE|TRANSPLANT_HEPATIC|TERAPIE_INTERMEDIARA_INGRIJIRE_POSTOPERATORIE_TIIP|SPRIJIN_POLITRAUMA|CHIRURGIE_ONCOLOGIE_MULTIVISCERALA|TRANSPLANT_TESUTURI_COMPOZITE|HEMORAGII_DIGESTIVE_GASTROENTEROLOGIE_INTERVENTIONALA|CHIRURGIE_REPARATORIE_A_PICIORULUI_DIABETIC|CHIRURGIE_ONCOLOGICA_COPII","B","J27"]
["CHIRURGIE_GENERALA_5","CHIRURGIE_ENDOSCOPICA|CHIRURGIE_HEPATICA|CHIRURGIE_LAPAROSCOPICA|CHIRURGIE_ONCOLOGICA_|CHIRURGIE_VASCULARA|FLEBOLOGIE|TRANSPLANT_HEPATIC|TERAPIE_INTERMEDIARA_INGRIJIRE_POSTOPERATORIE_TIIP|SPRIJIN_POLITRAUMA|CHIRURGIE_ONCOLOGIE_MULTIVISCERALA|TRANSPLANT_TESUTURI_COMPOZITE|HEMORAGII_DIGESTIVE_GASTROENTEROLOGIE_INTERVENTIONALA|CHIRURGIE_REPARATORIE_A_PICIORULUI_DIABETIC|CHIRURGIE_ONCOLOGICA_COPII","B","J27"]
["CHIRURGIE_ORALA_SI_MAXILO_FACIALA_1","CHIRURGIE_ORALA_SI_MAXILO_FACIALA_COPII","B","K27"]
["CHIRURGIE_ORALA_SI_MAXILO_FACIALA_2","CHIRURGIE_ORALA_SI_MAXILO_FACIALA_COPII","B","K27"]
["CHIRURGIE_ORALA_SI_MAXILO_FACIALA_3","CHIRURGIE_ORALA_SI_MAXILO_FACIALA_COPII","B","K27"]
["CHIRURGIE_ORALA_SI_MAXILO_FACIALA_4","CHIRURGIE_ORALA_SI_MAXILO_FACIALA_COPII","B","K27"]
["CHIRURGIE_ORALA_SI_MAXILO_FACIALA_5","CHIRURGIE_ORALA_SI_MAXILO_FACIALA_COPII","B","K27"]
["CHIRURGIE_PLASTICA_MICROCHIRURGIE_RECONSTRUCTIVA","ARSI|TI|TERAPIE_INTERMEDIARA_INGRIJIRE_POSTOPERATORIE_TIIP|UNITATE_FUNCTIONALA_PENTRU_ARSI","B","M27"]
["CHIRURGIE_PLASTICA_MICROCHIRURGIE_RECONSTRUCTIVA_COPII_1","ARSI","B","M27"]
["CHIRURGIE_PLASTICA_MICROCHIRURGIE_RECONSTRUCTIVA_COPII_2","ARSI","B","M27"]
["CHIRURGIE_VASCULARA","MICROCHIRURGIE_VASCULARA","B","J27"]
["DERMATOVENEROLOGIE_1","DERMATOVENEROLOGIE_COPII|PARAZITOLOGIE","B","Q27"]
["DERMATOVENEROLOGIE_2","DERMATOVENEROLOGIE_COPII|PARAZITOLOGIE","B","Q27"]
["DERMATOVENEROLOGIE_3","DERMATOVENEROLOGIE_COPII|PARAZITOLOGIE","B","Q27"]
["DIABET_ZAHARAT_NUTRITIE_SI_BOLI_METABOLICE_1","TA","B","R27"]
["DIABET_ZAHARAT_NUTRITIE_SI_BOLI_METABOLICE_2","TA","B","R27"]
["DIABET_ZAHARAT_NUTRITIE_SI_BOLI_METABOLICE_3","TA","B","R27"]
["ENDOCRINOLOGIE_1","ENDOCRINOLOGIE_COPII_|GUSA_ENDEMICA_SI_COMPLICATIILE_EI|INFERTILITATE_SI_PATOLOGIE_GONADICA|PATOLOGIA_TIROIDEI_DE_CORELATIE|PATOLOGIE_ENDOCRINO_METABOLICA|PATOLOGIE_HIPOFIZARA_SI_NEUROENDOCRINA|PATOLOGIE_SUPRARENALA_SI_A_METABOLISMULUI_OSOS","B","S27"]
["ENDOCRINOLOGIE_2","ENDOCRINOLOGIE_COPII|GUSA_ENDEMICA_SI_COMPLICATIILE_EI|INFERTILITATE_SI_PATOLOGIE_GONADICA|PATOLOGIA_TIROIDEI_DE_CORELATIE|PATOLOGIE_ENDOCRINO_METABOLICA|PATOLOGIE_HIPOFIZARA_SI_NEUROENDOCRINA|PATOLOGIE_SUPRARENALA_SI_A_METABOLISMULUI_OSOS","B","S27"]
["ENDOCRINOLOGIE_3","ENDOCRINOLOGIE_COPII|GUSA_ENDEMICA_SI_COMPLICATIILE_EI|INFERTILITATE_SI_PATOLOGIE_GONADICA|PATOLOGIA_TIROIDEI_DE_CORELATIE|PATOLOGIE_ENDOCRINO_METABOLICA|PATOLOGIE_HIPOFIZARA_SI_NEUROENDOCRINA|PATOLOGIE_SUPRARENALA_SI_A_METABOLISMULUI_OSOS","B","S27"]
["ENDOCRINOLOGIE_4","ENDOCRINOLOGIE_COPII|GUSA_ENDEMICA_SI_COMPLICATIILE_EI|INFERTILITATE_SI_PATOLOGIE_GONADICA|PATOLOGIA_TIROIDEI_DE_CORELATIE|PATOLOGIE_ENDOCRINO_METABOLICA|PATOLOGIE_HIPOFIZARA_SI_NEUROENDOCRINA|PATOLOGIE_SUPRARENALA_SI_A_METABOLISMULUI_OSOS","B","S27"]
["ENDOCRINOLOGIE_5","ENDOCRINOLOGIE_COPII|GUSA_ENDEMICA_SI_COMPLICATIILE_EI|INFERTILITATE_SI_PATOLOGIE_GONADICA|PATOLOGIA_TIROIDEI_DE_CORELATIE|PATOLOGIE_ENDOCRINO_METABOLICA|PATOLOGIE_HIPOFIZARA_SI_NEUROENDOCRINA|PATOLOGIE_SUPRARENALA_SI_A_METABOLISMULUI_OSOS","B","S27"]
["ENDOCRINOLOGIE_6","ENDOCRINOLOGIE_COPII|GUSA_ENDEMICA_SI_COMPLICATIILE_EI|INFERTILITATE_SI_PATOLOGIE_GONADICA|PATOLOGIA_TIROIDEI_DE_CORELATIE|PATOLOGIE_ENDOCRINO_METABOLICA|PATOLOGIE_HIPOFIZARA_SI_NEUROENDOCRINA|PATOLOGIE_SUPRARENALA_SI_A_METABOLISMULUI_OSOS","B","S27"]
["ENDOCRINOLOGIE_7","ENDOCRINOLOGIE_COPII|GUSA_ENDEMICA_SI_COMPLICATIILE_EI|INFERTILITATE_SI_PATOLOGIE_GONADICA|PATOLOGIA_TIROIDEI_DE_CORELATIE|PATOLOGIE_ENDOCRINO_METABOLICA|PATOLOGIE_HIPOFIZARA_SI_NEUROENDOCRINA|PATOLOGIE_SUPRARENALA_SI_A_METABOLISMULUI_OSOS","B","S27"]
["GASTROENTEROLOGIE_1","GASTROENTEROLOGIE_COPII|HEPATOLOGIE|TA","B","T27"]
["GASTROENTEROLOGIE_2","GASTROENTEROLOGIE_COPII_|HEPATOLOGIE|TA","B","T27"]
["GINECOLOGIE_1","GINECO_ONCOLOGIE","B","V27"]
["GINECOLOGIE_2","GINECO_ONCOLOGIE","B","V27"]
["HEMATOLOGIE_1","HEMATOLOGIE_COPII|TRANSPLANT_MEDULAR|TRANSPLANT_MEDULAR_ADULTI_SI_COPII|TA","B","W27"]
["HEMATOLOGIE_2","HEMATOLOGIE_COPII|TRANSPLANT_MEDULAR|TRANSPLANT_MEDULAR_ADULTI_SI_COPII|TA","B","W27"]
["HEMATOLOGIE_3","HEMATOLOGIE_COPII|TRANSPLANT_MEDULAR|TRANSPLANT_MEDULAR_ADULTI_SI_COPII|TA","B","W27"]
["HEMATOLOGIE_4","HEMATOLOGIE_COPII|TRANSPLANT_MEDULAR|TRANSPLANT_MEDULAR_ADULTI_SI_COPII|TA","B","W27"]
["HEMATOLOGIE_5","HEMATOLOGIE_COPII|TRANSPLANT_MEDULAR|TRANSPLANT_MEDULAR_ADULTI_SI_COPII|TA","B","W27"]
["HEMATOLOGIE_6","HEMATOLOGIE_COPII|TRANSPLANT_MEDULAR|TRANSPLANT_MEDULAR_ADULTI_SI_COPII|TA","B","W27"]
["HEMATOLOGIE_HEMOFILIE","TA","B","W27"]
["MEDICINA_INTERNA_1","MEDICINA_INTERNA_CRONIC|PNEUMOLOGIE_DIN_SECTIILE_MEDICALE|TA|TI|PNEUMOLOGIE_DIN_SECTIILE_MEDICALE_CRONICI","B","B36"]
["MEDICINA_INTERNA_2","MEDICINA_INTERNA_CRONIC|PNEUMOLOGIE_DIN_SECTIILE_MEDICALE|TA|TI|PNEUMOLOGIE_DIN_SECTIILE_MEDICALE_CRONICI","B","B36"]
["MEDICINA_INTERNA_3","MEDICINA_INTERNA_CRONIC|PNEUMOLOGIE_DIN_SECTIILE_MEDICALE|TA|TI|PNEUMOLOGIE_DIN_SECTIILE_MEDICALE_CRONICI","B","B36"]
["NEFROLOGIE_1","DIALIZA_PERITONEALA|HEMODIALIZA|TA|TI|","B","C36"]
["NEFROLOGIE_2","DIALIZA_PERITONEALA|HEMODIALIZA|TA|TI|","B","C36"]
["NEFROLOGIE_3","DIALIZA_PERITONEALA|HEMODIALIZA|TA|TI|","B","C36"]
["NEFROLOGIE_PEDIATRICA","DIALIZA_PERITONEALA|TI|TA","B","C36"]
["NEFROLOGIE_PENTRU_DIABETICI","DIALIZA_PERITONEALA","B","C36"]
["NEONATOLOGIE_1","PREMATURI|TA|TI","B","D36"]
["NEONATOLOGIE_2","PREMATURI|TA|TI","B","D36"]
["NEONATOLOGIE_PREMATURI","TI","B","D36"]
["NEUROCHIRURGIE_1","NEUROCHIRURGIE_PEDIATRICA_COPII","B","E36"]
["NEUROCHIRURGIE_2","NEUROCHIRURGIE_PEDIATRICA_COPII","B","E36"]
["NEUROCHIRURGIE_3","NEUROCHIRURGIE_PEDIATRICA_COPII","B","E36"]
["NEUROCHIRURGIE_4","NEUROCHIRURGIE_PEDIATRICA_COPII","B","E36"]
["NEUROCHIRURGIE_5","NEUROCHIRURGIE_PEDIATRICA_COPII","B","E36"]
["NEUROLOGIE_1","PENTRU_BOLNAVI_CU_MIASTENIA_GRAVIS|TA|TI|URGENTE_NEUROVASCULARE|NEUROLOGIE_CRONICI|UAVCA","B","F36"]
["NEUROLOGIE_2","PENTRU_BOLNAVI_CU_MIASTENIA_GRAVIS|TA|TI|URGENTE_NEUROVASCULARE|NEUROLOGIE_CRONICI|UAVCA","B","F36"]
["NEUROLOGIE_PEDIATRICA","TA","B","F36"]
["OBSTETRICA_1","MEDICINA_MATERNO_FETALA|OBSTETRICA_PATOLOGICA","B","G36"]
["OBSTETRICA_2","MEDICINA_MATERNO_FETALA|OBSTETRICA_PATOLOGICA","B","G36"]
["OBSTETRICA_3","MEDICINA_MATERNO_FETALA|OBSTETRICA_PATOLOGICA","B","G36"]
["OBSTETRICA_4","MEDICINA_MATERNO_FETALA|OBSTETRICA_PATOLOGICA","B","G36"]
["OBSTETRICA_GINECOLOGIE_1","FERTILIZARE_IN_VITRO|MEDICINA_MATERNO_FETALA|NASTERI_PRECIPITATE|TRATAMENTUL_INFERTILITATII_CUPLULUI_SI_REPRODUCERE_UMANA_ASISTATA","B","H36"]
["OBSTETRICA_GINECOLOGIE_2","FERTILIZARE_IN_VITRO|MEDICINA_MATERNO_FETALA|NASTERI_PRECIPITATE|TRATAMENTUL_INFERTILITATII_CUPLULUI_SI_REPRODUCERE_UMANA_ASISTATA","B","H36"]
["OBSTETRICA_GINECOLOGIE_3","FERTILIZARE_IN_VITRO|MEDICINA_MATERNO_FETALA|NASTERI_PRECIPITATE|TRATAMENTUL_INFERTILITATII_CUPLULUI_SI_REPRODUCERE_UMANA_ASISTATA","B","H36"]
["OBSTETRICA_GINECOLOGIE_4","FERTILIZARE_IN_VITRO|MEDICINA_MATERNO_FETALA|NASTERI_PRECIPITATE|TRATAMENTUL_INFERTILITATII_CUPLULUI_SI_REPRODUCERE_UMANA_ASISTATA","B","H36"]
["OBSTETRICA_PATOLOGICA","STERILITATE_INFERTILITATE","B","G36"]
["OFTALMOLOGIE_1","OFTALMOLOGIE_COPII","B","I36"]
["OFTALMOLOGIE_2","OFTALMOLOGIE_COPII","B","I36"]
["OFTALMOLOGIE_3","OFTALMOLOGIE_COPII","B","I36"]
["ONCOLOGIE_MEDICALA_1","RADIOTERAPIE|PNEUMOLOGIE_DIN_SECTIILE_MEDICALE_ONCOLOGIE|TERAPIE_CU_IZOTOPI","B","J36"]
["ONCOLOGIE_MEDICALA_2","RADIOTERAPIE|PNEUMOLOGIE_DIN_SECTIILE_MEDICALE_ONCOLOGIE|TERAPIE_CU_IZOTOPI","B","J36"]
["ORL_MICROCHIRURGIE_OTOLOGICA","IMPLANT_COHLEAR","B","J27"]
["ORL","ORL_COPII|IMPLANT_COHLEAR","B","K36"]
["ORTOPEDIE_SI_TRAUMATOLOGIE_1","ORTOPEDIE_PEDIATRICA|ORTOPEDIE_SI_TRAUMATOLOGIE_PEDIATRICA|TI|TERAPIE_INTERMEDIARA_INGRIJIRE_POSTOPERATORIE_TIIP","B","L36"]
["ORTOPEDIE_SI_TRAUMATOLOGIE_2","ORTOPEDIE_PEDIATRICA|ORTOPEDIE_SI_TRAUMATOLOGIE_PEDIATRICA|TI|TERAPIE_INTERMEDIARA_INGRIJIRE_POSTOPERATORIE_TIIP","B","L36"]
["ORTOPEDIE_SI_TRAUMATOLOGIE_3","ORTOPEDIE_PEDIATRICA|ORTOPEDIE_SI_TRAUMATOLOGIE_PEDIATRICA|TI|TERAPIE_INTERMEDIARA_INGRIJIRE_POSTOPERATORIE_TIIP","B","L36"]
["ORTOPEDIE_SI_TRAUMATOLOGIE_4","ORTOPEDIE_PEDIATRICA|ORTOPEDIE_SI_TRAUMATOLOGIE_PEDIATRICA|TI|TERAPIE_INTERMEDIARA_INGRIJIRE_POSTOPERATORIE_TIIP","B","L36"]
["PEDIATRIE_1","PNEUMOLOGIE_DIN_SECTIILE_MEDICALE|TA|TI|TRANSPLANT_MEDULAR|MEDICINA_RESPIRATORIE_PEDIATRICA","B","M36"]
["PEDIATRIE_2","PNEUMOLOGIE_DIN_SECTIILE_MEDICALE|TA|TI|TRANSPLANT_MEDULAR|MEDICINA_RESPIRATORIE_PEDIATRICA","B","M36"]
["PEDIATRIE_3","PNEUMOLOGIE_DIN_SECTIILE_MEDICALE|TA|TI|TRANSPLANT_MEDULAR|MEDICINA_RESPIRATORIE_PEDIATRICA","B","M36"]
["PEDIATRIE_4","PNEUMOLOGIE_DIN_SECTIILE_MEDICALE|TA|TI|TRANSPLANT_MEDULAR|MEDICINA_RESPIRATORIE_PEDIATRICA","B","M36"]
["PEDIATRIE_5","PNEUMOLOGIE_DIN_SECTIILE_MEDICALE|TA|TI|TRANSPLANT_MEDULAR|MEDICINA_RESPIRATORIE_PEDIATRICA","B","M36"]
["PEDIATRIE_6","PNEUMOLOGIE_DIN_SECTIILE_MEDICALE|TA|TI|TRANSPLANT_MEDULAR|MEDICINA_RESPIRATORIE_PEDIATRICA","B","M36"]
["PEDIATRIE_NEFROLOGIE","DIALIZA_PERITONEALA_COPII","B","C36"]
["PNEUMOLOGIE_DIN_SECTIILE_MEDICALE","TI|TA","B","B36"]
["PNEUMOLOGIE_DIN_SECTIILE_TBC_1","PNEUMOLOGIE_COPII_DIN_SECTIILE_TBC|TA|TI|PNEUMOLOGIE_DIN_SECTIILE_TBC_CRONICI|SOMNOLOGIE|PNEUMOLOGIE_DIN_SECTIILE_TBC_COPII_CRONICI","B","N36"]
["PNEUMOLOGIE_DIN_SECTIILE_TBC_2","PNEUMOLOGIE_COPII_DIN_SECTIILE_TBC|TA|TI|PNEUMOLOGIE_DIN_SECTIILE_TBC_CRONICI|SOMNOLOGIE|PNEUMOLOGIE_DIN_SECTIILE_TBC_COPII_CRONICI","B","N36"]
["PNEUMOLOGIE_DIN_SECTIILE_TBC_3","PNEUMOLOGIE_COPII_DIN_SECTIILE_TBC|TA|TI|PNEUMOLOGIE_DIN_SECTIILE_TBC_CRONICI|SOMNOLOGIE|PNEUMOLOGIE_DIN_SECTIILE_TBC_COPII_CRONICI","B","N36"]
["PNEUMOLOGIE_DIN_SECTIILE_TBC_4","PNEUMOLOGIE_COPII_DIN_SECTIILE_TBC|TA|TI|PNEUMOLOGIE_DIN_SECTIILE_TBC_CRONICI|SOMNOLOGIE|PNEUMOLOGIE_DIN_SECTIILE_TBC_COPII_CRONICI","B","N36"]
["PNEUMOLOGIE_DIN_SECTIILE_TBC_5","PNEUMOLOGIE_COPII_DIN_SECTIILE_TBC|TA|TI|PNEUMOLOGIE_DIN_SECTIILE_TBC_CRONICI|SOMNOLOGIE|PNEUMOLOGIE_DIN_SECTIILE_TBC_COPII_CRONICI","B","N36"]
["PNEUMOLOGIE_DIN_SECTIILE_TBC_6","PNEUMOLOGIE_COPII_DIN_SECTIILE_TBC|TA|TI|PNEUMOLOGIE_DIN_SECTIILE_TBC_CRONICI|SOMNOLOGIE|PNEUMOLOGIE_DIN_SECTIILE_TBC_COPII_CRONICI","B","N36"]
["PNEUMOLOGIE_DIN_SECTIILE_TBC_7","PNEUMOLOGIE_COPII_DIN_SECTIILE_TBC|TA|TI|PNEUMOLOGIE_DIN_SECTIILE_TBC_CRONICI|SOMNOLOGIE|PNEUMOLOGIE_DIN_SECTIILE_TBC_COPII_CRONICI","B","N36"]
["PNEUMOLOGIE_DIN_SECTIILE_TBC_8","PNEUMOLOGIE_COPII_DIN_SECTIILE_TBC|TA|TI|PNEUMOLOGIE_DIN_SECTIILE_TBC_CRONICI|SOMNOLOGIE|PNEUMOLOGIE_DIN_SECTIILE_TBC_COPII_CRONICI","B","N36"]
["PNEUMOLOGIE_DIN_SECTIILE_TBC_COPII_1","PNEUMOLOGIE_DIN_SECTIILE_TBC_COPII_CRONICI|SOMNOLOGIE","B","N36"]
["PNEUMOLOGIE_DIN_SECTIILE_TBC_COPII_2","PNEUMOLOGIE_DIN_SECTIILE_TBC_COPII_CRONICI|SOMNOLOGIE","B","N36"]
["PNEUMOLOGIE_TBC_1","PNEUMOLOGIE_TBC_COPII|TI|PNEUMOLOGIE_TBC_MDR_MULTIDROG_REZISTENTA","B","O36"]
["PNEUMOLOGIE_TBC_2","PNEUMOLOGIE_TBC_COPII|TI|PNEUMOLOGIE_TBC_MDR_MULTIDROG_REZISTENTA","B","O36"]
["PNEUMOLOGIE_TBC_3","PNEUMOLOGIE_TBC_COPII|TI|PNEUMOLOGIE_TBC_MDR_MULTIDROG_REZISTENTA","B","O36"]
["PNEUMOLOGIE_TBC_4","PNEUMOLOGIE_TBC_COPII|TI|PNEUMOLOGIE_TBC_MDR_MULTIDROG_REZISTENTA","B","O36"]
["PNEUMOLOGIE_TBC_5","PNEUMOLOGIE_TBC_COPII|TI|PNEUMOLOGIE_TBC_MDR_MULTIDROG_REZISTENTA","B","O36"]
["PNEUMOLOGIE_TBC_6","PNEUMOLOGIE_TBC_COPII|TI|PNEUMOLOGIE_TBC_MDR_MULTIDROG_REZISTENTA","B","O36"]
["PNEUMOLOGIE_TBC_7","PNEUMOLOGIE_TBC_COPII|TI|PNEUMOLOGIE_TBC_MDR_MULTIDROG_REZISTENTA","B","O36"]
["PNEUMOLOGIE_TBC_8","PNEUMOLOGIE_TBC_COPII|TI|PNEUMOLOGIE_TBC_MDR_MULTIDROG_REZISTENTA","B","O36"]
["PNEUMOLOGIE_TBC_9","PNEUMOLOGIE_TBC_COPII|TI|PNEUMOLOGIE_TBC_MDR_MULTIDROG_REZISTENTA","B","O36"]
["PNEUMOLOGIE_TBC_10","PNEUMOLOGIE_TBC_COPII|TI|PNEUMOLOGIE_TBC_MDR_MULTIDROG_REZISTENTA","B","O36"]
["PNEUMOLOGIE_TBC_11","PNEUMOLOGIE_TBC_COPII|TI|PNEUMOLOGIE_TBC_MDR_MULTIDROG_REZISTENTA","B","O36"]
["PNEUMOLOGIE_TBC_12","PNEUMOLOGIE_TBC_COPII|TI|PNEUMOLOGIE_TBC_MDR_MULTIDROG_REZISTENTA","B","O36"]
["PSIHIATRIE_1","INTERNARI_NEVOLUNTARE|NEVROZE|PSIHIATRIE_PEDIATRICA_COPII|PSIHOGERIATRIE|CURA_TOXICODEPENDENTE|URGENTE_PSIHIATRICE|NEUROPSIHIATRIE_INFANTILA","B","P36"]
["PSIHIATRIE_2","INTERNARI_NEVOLUNTARE|NEVROZE|PSIHIATRIE_PEDIATRICA_COPII|PSIHOGERIATRIE|CURA_TOXICODEPENDENTE|URGENTE_PSIHIATRICE|NEUROPSIHIATRIE_INFANTILA","B","P36"]
["PSIHIATRIE_3","INTERNARI_NEVOLUNTARE|NEVROZE|PSIHIATRIE_PEDIATRICA_COPII|PSIHOGERIATRIE|CURA_TOXICODEPENDENTE|URGENTE_PSIHIATRICE|NEUROPSIHIATRIE_INFANTILA","B","P36"]
["PSIHIATRIE_ACUTI_1","ALCOOLISM|CURA_TOXICODEPENDENTE|TOXICOMANIE|URGENTE_PSIHIATRICE","B","Q36"]
["PSIHIATRIE_ACUTI_2","ALCOOLISM|CURA_TOXICODEPENDENTE|TOXICOMANIE|URGENTE_PSIHIATRICE","B","Q36"]
["PSIHIATRIE_ACUTI_3","ALCOOLISM|CURA_TOXICODEPENDENTE|TOXICOMANIE|URGENTE_PSIHIATRICE","B","Q36"]
["PSIHIATRIE_ACUTI_4","ALCOOLISM|CURA_TOXICODEPENDENTE|TOXICOMANIE|URGENTE_PSIHIATRICE","B","Q36"]
["PSIHIATRIE_ACUTI_5","ALCOOLISM|CURA_TOXICODEPENDENTE|TOXICOMANIE|URGENTE_PSIHIATRICE","B","Q36"]
["PSIHIATRIE_ACUTI_6","ALCOOLISM|CURA_TOXICODEPENDENTE|TOXICOMANIE|URGENTE_PSIHIATRICE","B","Q36"]
["PSIHIATRIE_ACUTI_7","ALCOOLISM|CURA_TOXICODEPENDENTE|TOXICOMANIE|URGENTE_PSIHIATRICE","B","Q36"]
["PSIHIATRIE_ACUTI_8","ALCOOLISM|CURA_TOXICODEPENDENTE|TOXICOMANIE|URGENTE_PSIHIATRICE","B","Q36"]
["PSIHIATRIE_ACUTI_9","ALCOOLISM|CURA_TOXICODEPENDENTE|TOXICOMANIE|URGENTE_PSIHIATRICE","B","Q36"]
["PSIHIATRIE_ACUTI_10","ALCOOLISM|CURA_TOXICODEPENDENTE|TOXICOMANIE|URGENTE_PSIHIATRICE","B","Q36"]
["PSIHIATRIE_ACUTI_11","ALCOOLISM|CURA_TOXICODEPENDENTE|TOXICOMANIE|URGENTE_PSIHIATRICE","B","Q36"]
["PSIHIATRIE_ACUTI_12","ALCOOLISM|CURA_TOXICODEPENDENTE|TOXICOMANIE|URGENTE_PSIHIATRICE","B","Q36"]
["PSIHIATRIE_ACUTI_13","ALCOOLISM|CURA_TOXICODEPENDENTE|TOXICOMANIE|URGENTE_PSIHIATRICE","B","Q36"]
["PSIHIATRIE_ACUTI_14","ALCOOLISM|CURA_TOXICODEPENDENTE|TOXICOMANIE|URGENTE_PSIHIATRICE","B","Q36"]
["PSIHIATRIE_ACUTI_15","ALCOOLISM|CURA_TOXICODEPENDENTE|TOXICOMANIE|URGENTE_PSIHIATRICE","B","Q36"]
["PSIHIATRIE_ACUTI_16","ALCOOLISM|CURA_TOXICODEPENDENTE|TOXICOMANIE|URGENTE_PSIHIATRICE","B","Q36"]
["PSIHIATRIE_CRONICI_1","BOLNAVI_PSIHICI_CU_TBC_PULMONAR|BOLNAVI_PSIHICI_CU_TBC_PULMONAR_COD_PENAL|CRONICI_AFECTIUNI_PSIHOSOMATICE|DEMENTA_SENILA_SI_BOALA_ALZHEIMER|PSIHIATRIE_DEMENTE|TERAPIE_OCUPATIONALA_SI_ERGOTERAPIE|COD_PENAL","B","R36"]
["PSIHIATRIE_CRONICI_2","BOLNAVI_PSIHICI_CU_TBC_PULMONAR|BOLNAVI_PSIHICI_CU_TBC_PULMONAR_COD_PENAL|CRONICI_AFECTIUNI_PSIHOSOMATICE|DEMENTA_SENILA_SI_BOALA_ALZHEIMER|PSIHIATRIE_DEMENTE|TERAPIE_OCUPATIONALA_SI_ERGOTERAPIE|COD_PENAL","B","R36"]
["PSIHIATRIE_CRONICI_3","BOLNAVI_PSIHICI_CU_TBC_PULMONAR|BOLNAVI_PSIHICI_CU_TBC_PULMONAR_COD_PENAL|CRONICI_AFECTIUNI_PSIHOSOMATICE|DEMENTA_SENILA_SI_BOALA_ALZHEIMER|PSIHIATRIE_DEMENTE|TERAPIE_OCUPATIONALA_SI_ERGOTERAPIE|COD_PENAL","B","R36"]
["PSIHIATRIE_CRONICI_4","BOLNAVI_PSIHICI_CU_TBC_PULMONAR|BOLNAVI_PSIHICI_CU_TBC_PULMONAR_COD_PENAL|CRONICI_AFECTIUNI_PSIHOSOMATICE|DEMENTA_SENILA_SI_BOALA_ALZHEIMER|PSIHIATRIE_DEMENTE|TERAPIE_OCUPATIONALA_SI_ERGOTERAPIE|COD_PENAL","B","R36"]
["PSIHIATRIE_CRONICI_5","BOLNAVI_PSIHICI_CU_TBC_PULMONAR|BOLNAVI_PSIHICI_CU_TBC_PULMONAR_COD_PENAL|CRONICI_AFECTIUNI_PSIHOSOMATICE|DEMENTA_SENILA_SI_BOALA_ALZHEIMER|PSIHIATRIE_DEMENTE|TERAPIE_OCUPATIONALA_SI_ERGOTERAPIE|COD_PENAL","B","R36"]
["PSIHIATRIE_CRONICI_6","BOLNAVI_PSIHICI_CU_TBC_PULMONAR|BOLNAVI_PSIHICI_CU_TBC_PULMONAR_COD_PENAL|CRONICI_AFECTIUNI_PSIHOSOMATICE|DEMENTA_SENILA_SI_BOALA_ALZHEIMER|PSIHIATRIE_DEMENTE|TERAPIE_OCUPATIONALA_SI_ERGOTERAPIE|COD_PENAL","B","R36"]
["PSIHIATRIE_CRONICI_7","BOLNAVI_PSIHICI_CU_TBC_PULMONAR|BOLNAVI_PSIHICI_CU_TBC_PULMONAR_COD_PENAL|CRONICI_AFECTIUNI_PSIHOSOMATICE|DEMENTA_SENILA_SI_BOALA_ALZHEIMER|PSIHIATRIE_DEMENTE|TERAPIE_OCUPATIONALA_SI_ERGOTERAPIE|COD_PENAL","B","R36"]
["PSIHIATRIE_CRONICI_8","BOLNAVI_PSIHICI_CU_TBC_PULMONAR|BOLNAVI_PSIHICI_CU_TBC_PULMONAR_COD_PENAL|CRONICI_AFECTIUNI_PSIHOSOMATICE|DEMENTA_SENILA_SI_BOALA_ALZHEIMER|PSIHIATRIE_DEMENTE|TERAPIE_OCUPATIONALA_SI_ERGOTERAPIE|COD_PENAL","B","R36"]
["PSIHIATRIE_CRONICI_9","BOLNAVI_PSIHICI_CU_TBC_PULMONAR|BOLNAVI_PSIHICI_CU_TBC_PULMONAR_COD_PENAL|CRONICI_AFECTIUNI_PSIHOSOMATICE|DEMENTA_SENILA_SI_BOALA_ALZHEIMER|PSIHIATRIE_DEMENTE|TERAPIE_OCUPATIONALA_SI_ERGOTERAPIE|COD_PENAL","B","R36"]
["PSIHIATRIE_CRONICI_10","BOLNAVI_PSIHICI_CU_TBC_PULMONAR|BOLNAVI_PSIHICI_CU_TBC_PULMONAR_COD_PENAL|CRONICI_AFECTIUNI_PSIHOSOMATICE|DEMENTA_SENILA_SI_BOALA_ALZHEIMER|PSIHIATRIE_DEMENTE|TERAPIE_OCUPATIONALA_SI_ERGOTERAPIE|COD_PENAL","B","R36"]
["PSIHIATRIE_CRONICI_11","BOLNAVI_PSIHICI_CU_TBC_PULMONAR|BOLNAVI_PSIHICI_CU_TBC_PULMONAR_COD_PENAL|CRONICI_AFECTIUNI_PSIHOSOMATICE|DEMENTA_SENILA_SI_BOALA_ALZHEIMER|PSIHIATRIE_DEMENTE|TERAPIE_OCUPATIONALA_SI_ERGOTERAPIE|COD_PENAL","B","R36"]
["PSIHIATRIE_CRONICI_12","BOLNAVI_PSIHICI_CU_TBC_PULMONAR|BOLNAVI_PSIHICI_CU_TBC_PULMONAR_COD_PENAL|CRONICI_AFECTIUNI_PSIHOSOMATICE|DEMENTA_SENILA_SI_BOALA_ALZHEIMER|PSIHIATRIE_DEMENTE|TERAPIE_OCUPATIONALA_SI_ERGOTERAPIE|COD_PENAL","B","R36"]
["PSIHIATRIE_CRONICI_13","BOLNAVI_PSIHICI_CU_TBC_PULMONAR|BOLNAVI_PSIHICI_CU_TBC_PULMONAR_COD_PENAL|CRONICI_AFECTIUNI_PSIHOSOMATICE|DEMENTA_SENILA_SI_BOALA_ALZHEIMER|PSIHIATRIE_DEMENTE|TERAPIE_OCUPATIONALA_SI_ERGOTERAPIE|COD_PENAL","B","R36"]
["PSIHIATRIE_CRONICI_14","BOLNAVI_PSIHICI_CU_TBC_PULMONAR|BOLNAVI_PSIHICI_CU_TBC_PULMONAR_COD_PENAL|CRONICI_AFECTIUNI_PSIHOSOMATICE|DEMENTA_SENILA_SI_BOALA_ALZHEIMER|PSIHIATRIE_DEMENTE|TERAPIE_OCUPATIONALA_SI_ERGOTERAPIE|COD_PENAL","B","R36"]
["PSIHIATRIE_CRONICI_15","BOLNAVI_PSIHICI_CU_TBC_PULMONAR|BOLNAVI_PSIHICI_CU_TBC_PULMONAR_COD_PENAL|CRONICI_AFECTIUNI_PSIHOSOMATICE|DEMENTA_SENILA_SI_BOALA_ALZHEIMER|PSIHIATRIE_DEMENTE|TERAPIE_OCUPATIONALA_SI_ERGOTERAPIE|COD_PENAL","B","R36"]
["PSIHIATRIE_CRONICI_16","BOLNAVI_PSIHICI_CU_TBC_PULMONAR|BOLNAVI_PSIHICI_CU_TBC_PULMONAR_COD_PENAL|CRONICI_AFECTIUNI_PSIHOSOMATICE|DEMENTA_SENILA_SI_BOALA_ALZHEIMER|PSIHIATRIE_DEMENTE|TERAPIE_OCUPATIONALA_SI_ERGOTERAPIE|COD_PENAL","B","R36"]
["PSIHIATRIE_DROGODEPENDENTA","TOXICOMANIE","B","Q36"]
["RADIOTERAPIE_1","COBALTOTERAPIE|CURIETERAPIE|MEDICINA_NUCLEARA|TERAPIE_CU_IZOTOPI","B","J36"]
["RADIOTERAPIE_2","COBALTOTERAPIE|CURIETERAPIE|MEDICINA_NUCLEARA|TERAPIE_CU_IZOTOPI","B","J36"]
["RADIOTERAPIE_3","COBALTOTERAPIE|CURIETERAPIE|MEDICINA_NUCLEARA|TERAPIE_CU_IZOTOPI","B","J36"]
["RADIOTERAPIE_M_AP_N","RADIOPATOLOGIE","B","J36"]
["RECUPERARE_BOLI_CARDIOVASCULARE_1","TI_CORONARIENI","B","S36"]
["RECUPERARE_BOLI_CARDIOVASCULARE_2","TI_CORONARIENI","B","S36"]
["RECUPERARE_BOLI_CARDIOVASCULARE_3","TI_CORONARIENI","B","S36"]
["RECUPERARE_BOLI_CARDIOVASCULARE_4","TI_CORONARIENI","B","S36"]
["RECUPERARE_BOLI_CARDIOVASCULARE_5","TI_CORONARIENI","B","S36"]
["RECUPERARE_BOLI_CARDIOVASCULARE_6","TI_CORONARIENI","B","S36"]
["RECUPERARE_BOLI_CARDIOVASCULARE_7","TI_CORONARIENI","B","S36"]
["RECUPERARE_BOLI_CARDIOVASCULARE_8","TI_CORONARIENI","B","S36"]
["RECUPERARE_BOLI_CARDIOVASCULARE_9","TI_CORONARIENI","B","S36"]
["RECUPERARE_BOLI_CARDIOVASCULARE_10","TI_CORONARIENI","B","S36"]
["RECUPERARE_NEUROPSIHOMOTORIE_COPII","TI|RECUPERARE_CRONICI_NEUROLOGIE_PEDIATRICA","B","T36"]
["TOXICOLOGIE_1","TOXICOLOGIE_COPII","B","A45"]
["TOXICOLOGIE_2","TOXICOLOGIE_COPII","B","A45"]
["TOXICOMANIE","TOXICOMANIE_COPII","B","Q36"]
["UROLOGIE_1","ENDOUROLOGIE|LITOTRITIE|TRANSPLANT_RENAL|UROLOGIE_COPII","B","B45"]
["UROLOGIE_2","ENDOUROLOGIE|LITOTRITIE|TRANSPLANT_RENAL|UROLOGIE_COPII","B","B45"]
["UROLOGIE_3","ENDOUROLOGIE|LITOTRITIE|TRANSPLANT_RENAL|UROLOGIE_COPII","B","B45"]
["UROLOGIE_4","ENDOUROLOGIE|LITOTRITIE|TRANSPLANT_RENAL|UROLOGIE_COPII","B","B45"]
["PNEUMOLOGIE","PMEUMOLOGIE_CRONICI","B","C45"]

{"sheet":"Copac2022","index":15,"n_rows":377,"n_cols":35,"rows_kept":377,"cut":false,"hidden":true,"merged":[]}
["Sectii"]
["ALERGOLOGIE_SI_IMUNOLOGIE","ALERGOLOGIE_SI_IMUNOLOGIE_COPII"]
["ATI_1","ATI_ARSI","ATI_CHIRURGIE_CARDIOVASCULARA","ATI_CHIRURGIE_GENERALA","ATI_CHIRURGIE_PLASTICA","ATI_COPII","ATI_NEUROCHIRURGIE","ATI_NOU_NASCUTI_DIN_PEDIATRIE","ATI_OBSTETRICA_GINECOLOGIE","ATI_OFTALMOLOGIE","ATI_ORL","ATI_ORL_SI_OFTALMOLOGIE","ATI_ORTOPEDIE_SI_TRAUMATOLOGIE","ATI_POLITRAUMATISME","ATI_TOXICOLOGIE","TI_CORONARIENI","TI_HEPATOLOGIE","TI_NEONATOLOGIE","ATI_UROLOGIE"]
["ATI_2","ATI_ARSI","ATI_CHIRURGIE_CARDIOVASCULARA","ATI_CHIRURGIE_GENERALA","ATI_CHIRURGIE_PLASTICA","ATI_COPII","ATI_NEUROCHIRURGIE","ATI_NOU_NASCUTI_DIN_PEDIATRIE","ATI_OBSTETRICA_GINECOLOGIE","ATI_OFTALMOLOGIE","ATI_ORL","ATI_ORL_SI_OFTALMOLOGIE","ATI_ORTOPEDIE_SI_TRAUMATOLOGIE","ATI_POLITRAUMATISME","ATI_TOXICOLOGIE","TI_CORONARIENI","TI_HEPATOLOGIE","TI_NEONATOLOGIE","ATI_UROLOGIE"]
["ATI_3","ATI_ARSI","ATI_CHIRURGIE_CARDIOVASCULARA","ATI_CHIRURGIE_GENERALA","ATI_CHIRURGIE_PLASTICA","ATI_COPII","ATI_NEUROCHIRURGIE","ATI_NOU_NASCUTI_DIN_PEDIATRIE","ATI_OBSTETRICA_GINECOLOGIE","ATI_OFTALMOLOGIE","ATI_ORL","ATI_ORL_SI_OFTALMOLOGIE","ATI_ORTOPEDIE_SI_TRAUMATOLOGIE","ATI_POLITRAUMATISME","ATI_TOXICOLOGIE","TI_CORONARIENI","TI_HEPATOLOGIE","TI_NEONATOLOGIE","ATI_UROLOGIE"]
["ATI_4","ATI_ARSI","ATI_CHIRURGIE_CARDIOVASCULARA","ATI_CHIRURGIE_GENERALA","ATI_CHIRURGIE_PLASTICA","ATI_COPII","ATI_NEUROCHIRURGIE","ATI_NOU_NASCUTI_DIN_PEDIATRIE","ATI_OBSTETRICA_GINECOLOGIE","ATI_OFTALMOLOGIE","ATI_ORL","ATI_ORL_SI_OFTALMOLOGIE","ATI_ORTOPEDIE_SI_TRAUMATOLOGIE","ATI_POLITRAUMATISME","ATI_TOXICOLOGIE","TI_CORONARIENI","TI_HEPATOLOGIE","TI_NEONATOLOGIE","ATI_UROLOGIE"]
["ATI_5","ATI_ARSI","ATI_CHIRURGIE_CARDIOVASCULARA","ATI_CHIRURGIE_GENERALA","ATI_CHIRURGIE_PLASTICA","ATI_COPII","ATI_NEUROCHIRURGIE","ATI_NOU_NASCUTI_DIN_PEDIATRIE","ATI_OBSTETRICA_GINECOLOGIE","ATI_OFTALMOLOGIE","ATI_ORL","ATI_ORL_SI_OFTALMOLOGIE","ATI_ORTOPEDIE_SI_TRAUMATOLOGIE","ATI_POLITRAUMATISME","ATI_TOXICOLOGIE","TI_CORONARIENI","TI_HEPATOLOGIE","TI_NEONATOLOGIE","ATI_UROLOGIE"]
["ATI_COPII_1","TI","TA_NEONATOLOGIE","ATI_CHIRURGIE_CARDIOVASCULARA"]
["ATI_COPII_2","TI","TA_NEONATOLOGIE","ATI_CHIRURGIE_CARDIOVASCULARA"]
["ATI_COPII_3","TI","TA_NEONATOLOGIE","ATI_CHIRURGIE_CARDIOVASCULARA"]
["ATI_COPII_4","TI","TA_NEONATOLOGIE","ATI_CHIRURGIE_CARDIOVASCULARA"]
["ATI_COPII_5","TI","TA_NEONATOLOGIE","ATI_CHIRURGIE_CARDIOVASCULARA"]
["ATI_COPII_6","TI","TA_NEONATOLOGIE","ATI_CHIRURGIE_CARDIOVASCULARA"]
["ATI_UROLOGIE"]
["ATI_COVID_1"]
["ATI_COVID_2"]
["ATI_COVID_COPII"]
["BOLI_CRONICE","INGRIJIRI_PALIATIVE"]
["BOLI_INFECTIOASE_COPII_1","HIV_SIDA","TA","TI"]
["BOLI_INFECTIOASE_COPII_2","HIV_SIDA","TA","TI"]
["BOLI_INFECTIOASE_COPII_3","HIV_SIDA","TA","TI"]
["BOLI_INFECTIOASE_COPII_4","HIV_SIDA","TA","TI"]
["BOLI_INFECTIOASE_COPII_5","HIV_SIDA","TA","TI"]
["BOLI_INFECTIOASE_COPII_6","HIV_SIDA","TA","TI"]
["BOLI_INFECTIOASE_HIV_SIDA_1","BOLI_INFECTIOASE_COPII_HIV_SIDA","INGRIJIRI_PALIATIVE"]
["BOLI_INFECTIOASE_HIV_SIDA_2","BOLI_INFECTIOASE_COPII_HIV_SIDA","INGRIJIRI_PALIATIVE"]
["BOLI_INFECTIOASE_CRONICI_HIV_SIDA"]
["BOLI_INFECTIOASE_MAPN"]
["BOLI_INFECTIOASE_SI_TROPICALE","BOLI_INFECTIOASE_SI_TROPICALE_COPII","TI","CRONICI"]
["BOLI_INFECŢIOASE_1","BOLI_INFECTIOASE_COPII","HIV_SIDA","INGRIJIRI_PALIATIVE","PARAZITOLOGIE","TA","TI","HIV_SIDA_ADULTI","HIV_SIDA_COPII","BOLI_CRONICE","DERMATOVENEROLOGIE"]
["BOLI_INFECŢIOASE_2","BOLI_INFECTIOASE_COPII","HIV_SIDA","INGRIJIRI_PALIATIVE","PARAZITOLOGIE","TA","TI","HIV_SIDA_ADULTI","HIV_SIDA_COPII","BOLI_CRONICE","DERMATOVENEROLOGIE"]
["BOLI_INFECŢIOASE_3","BOLI_INFECTIOASE_COPII","HIV_SIDA","INGRIJIRI_PALIATIVE","PARAZITOLOGIE","TA","TI","HIV_SIDA_ADULTI","HIV_SIDA_COPII","BOLI_CRONICE","DERMATOVENEROLOGIE"]
["BOLI_INFECŢIOASE_4","BOLI_INFECTIOASE_COPII","HIV_SIDA","INGRIJIRI_PALIATIVE","PARAZITOLOGIE","TA","TI","HIV_SIDA_ADULTI","HIV_SIDA_COPII","BOLI_CRONICE","DERMATOVENEROLOGIE"]
["BOLI_INFECŢIOASE_5","BOLI_INFECTIOASE_COPII","HIV_SIDA","INGRIJIRI_PALIATIVE","PARAZITOLOGIE","TA","TI","HIV_SIDA_ADULTI","HIV_SIDA_COPII","BOLI_CRONICE","DERMATOVENEROLOGIE"]
["BOLI_INFECŢIOASE_6","BOLI_INFECTIOASE_COPII","HIV_SIDA","INGRIJIRI_PALIATIVE","PARAZITOLOGIE","TA","TI","HIV_SIDA_ADULTI","HIV_SIDA_COPII","BOLI_CRONICE","DERMATOVENEROLOGIE"]
["BOLI_PARAZITARE"]
["BOLI_PROFESIONALE","RADIOPATOLOGIE"]
["CARDIOLOGIE_1","CARDIOLOGIE_INTERVENTIONALA","CARDIOLOGIE_PEDIATRICA","PATOLOGIE_STABILIZATA_SI_CRONICA","RECUPERARE_CARDIOLOGIE","TI_CORONARIENI","TI","USTAC","CARDIOLOGIE_INTERVENTIONALA_SI_ELECTROFIZIOLOGIE","RECUPERARE_MEDICALA_CARDIOVASCULARA","CARDIOLOGIE_CRONICI"]
["CARDIOLOGIE_2","CARDIOLOGIE_INTERVENTIONALA","CARDIOLOGIE_PEDIATRICA","PATOLOGIE_STABILIZATA_SI_CRONICA","RECUPERARE_CARDIOLOGIE","TI_CORONARIENI","TI","USTAC","CARDIOLOGIE_INTERVENTIONALA_SI_ELECTROFIZIOLOGIE","RECUPERARE_MEDICALA_CARDIOVASCULARA","CARDIOLOGIE_CRONICI"]
["CARDIOLOGIE_3","CARDIOLOGIE_INTERVENTIONALA","CARDIOLOGIE_PEDIATRICA","PATOLOGIE_STABILIZATA_SI_CRONICA","RECUPERARE_CARDIOLOGIE","TI_CORONARIENI","TI","USTAC","CARDIOLOGIE_INTERVENTIONALA_SI_ELECTROFIZIOLOGIE","RECUPERARE_MEDICALA_CARDIOVASCULARA","CARDIOLOGIE_CRONICI"]
["CARDIOLOGIE_4","CARDIOLOGIE_INTERVENTIONALA","CARDIOLOGIE_PEDIATRICA","PATOLOGIE_STABILIZATA_SI_CRONICA","RECUPERARE_CARDIOLOGIE","TI_CORONARIENI","TI","USTAC","CARDIOLOGIE_INTERVENTIONALA_SI_ELECTROFIZIOLOGIE","RECUPERARE_MEDICALA_CARDIOVASCULARA","CARDIOLOGIE_CRONICI"]
["CARDIOLOGIE_CRONICI"]
["CARDIOLOGIE_INTERVENTIONALA","USTAC"]
["CARDIOLOGIE_PATOLOGIE_STABILIZATA_SI_CRONICA"]
["CARDIOLOGIE_PEDIATRICA_1","TI_CORONARIENI","GENETICA_MEDICALA"]
["CARDIOLOGIE_PEDIATRICA_2","TI_CORONARIENI","GENETICA_MEDICALA"]
["CARDIOLOGIE_PEDIATRICA_3","TI_CORONARIENI","GENETICA_MEDICALA"]
["CARDIOLOGIE_PENTRU_DIABETICI"]
["CHIRURGIE_CARDIACA_SI_A_VASELOR_MARI","ATI"]
["CHIRURGIE_CARDIOVASCULARA_1","ATI_COPII","ATI","CHIRURGIE_CARDIOVASCULARA_COPII","CHIRURGIE_TORACICA","TRANSPLANT","CHIRURGIE_VASCULARA"]
["CHIRURGIE_CARDIOVASCULARA_2","ATI_COPII","ATI","CHIRURGIE_CARDIOVASCULARA_COPII","CHIRURGIE_TORACICA","TRANSPLANT","CHIRURGIE_VASCULARA"]
["CHIRURGIE_CARDIOVASCULARA_ADULTI_SI_COPII","CHIRURGIE_CARDIOVASCULARA_COPII","TRANSPLANT"]
["CHIRURGIE_ENDOCRINA","ATI"]
["CHIRURGIE_GENERALA_1","ARSI","ATI","CHIRURGIE_ENDOSCOPICA","CHIRURGIE_HEPATICA","CHIRURGIE_LAPAROSCOPICA","CHIRURGIE_MAXILO_FACIALA","CHIRURGIE_ONCOLOGICA_","CHIRURGIE_ORALA_SI_MAXILO_FACIALA","CHIRURGIE_PEDIATRICA","CHIRURGIE_PLASTICA_MICROCHIRURGIE_RECONSTRUCTIVA","CHIRURGIE_REPARATORIE_A_PICIORULUI_DIABETIC","CHIRURGIE_SI_ORTOPEDIE_INFANTILA_PEDIATRICA","CHIRURGIE_TORACICA","CHIRURGIE_TORACICA_SI_ESOFAGIANA","CHIRURGIE_VASCULARA","CRONICI","FLEBOLOGIE","NEUROCHIRURGIE","OBSTETRICA_GINECOLOGIE","OFTALMOLOGIE","ORL","ORTOPEDIE_SI_TRAUMATOLOGIE","TRANSPLANT_HEPATIC","UROLOGIE","GINECOLOGIE","CHIRURGIE_CARDIOVASCULARA","NEONATOLOGIE","TERAPIE_INTERMEDIARA_INGRIJIRE_POSTOPERATORIE_TIIP","SPRIJIN_POLITRAUMA","CHIRURGIE_ONCOLOGIE_MULTIVISCERALA","TRANSPLANT_TESUTURI_COMPOZITE","HEMORAGII_DIGESTIVE_GASTROENTEROLOGIE_INTERVENTIONALA","GINECO_ONCOLOGIE"]
["CHIRURGIE_GENERALA_2","ARSI","ATI","CHIRURGIE_ENDOSCOPICA","CHIRURGIE_HEPATICA","CHIRURGIE_LAPAROSCOPICA","CHIRURGIE_MAXILO_FACIALA","CHIRURGIE_ONCOLOGICA_","CHIRURGIE_ORALA_SI_MAXILO_FACIALA","CHIRURGIE_PEDIATRICA","CHIRURGIE_PLASTICA_MICROCHIRURGIE_RECONSTRUCTIVA","CHIRURGIE_REPARATORIE_A_PICIORULUI_DIABETIC","CHIRURGIE_SI_ORTOPEDIE_INFANTILA_PEDIATRICA","CHIRURGIE_TORACICA","CHIRURGIE_TORACICA_SI_ESOFAGIANA","CHIRURGIE_VASCULARA","CRONICI","FLEBOLOGIE","NEUROCHIRURGIE","OBSTETRICA_GINECOLOGIE","OFTALMOLOGIE","ORL","ORTOPEDIE_SI_TRAUMATOLOGIE","TRANSPLANT_HEPATIC","UROLOGIE","GINECOLOGIE","CHIRURGIE_CARDIOVASCULARA","NEONATOLOGIE","TERAPIE_INTERMEDIARA_INGRIJIRE_POSTOPERATORIE_TIIP","SPRIJIN_POLITRAUMA","CHIRURGIE_ONCOLOGIE_MULTIVISCERALA","TRANSPLANT_TESUTURI_COMPOZITE","HEMORAGII_DIGESTIVE_GASTROENTEROLOGIE_INTERVENTIONALA","GINECO_ONCOLOGIE"]
["CHIRURGIE_GENERALA_3","ARSI","ATI","CHIRURGIE_ENDOSCOPICA","CHIRURGIE_HEPATICA","CHIRURGIE_LAPAROSCOPICA","CHIRURGIE_MAXILO_FACIALA","CHIRURGIE_ONCOLOGICA_","CHIRURGIE_ORALA_SI_MAXILO_FACIALA","CHIRURGIE_PEDIATRICA","CHIRURGIE_PLASTICA_MICROCHIRURGIE_RECONSTRUCTIVA","CHIRURGIE_REPARATORIE_A_PICIORULUI_DIABETIC","CHIRURGIE_SI_ORTOPEDIE_INFANTILA_PEDIATRICA","CHIRURGIE_TORACICA","CHIRURGIE_TORACICA_SI_ESOFAGIANA","CHIRURGIE_VASCULARA","CRONICI","FLEBOLOGIE","NEUROCHIRURGIE","OBSTETRICA_GINECOLOGIE","OFTALMOLOGIE","ORL","ORTOPEDIE_SI_TRAUMATOLOGIE","TRANSPLANT_HEPATIC","UROLOGIE","GINECOLOGIE","CHIRURGIE_CARDIOVASCULARA","NEONATOLOGIE","TERAPIE_INTERMEDIARA_INGRIJIRE_POSTOPERATORIE_TIIP","SPRIJIN_POLITRAUMA","CHIRURGIE_ONCOLOGIE_MULTIVISCERALA","TRANSPLANT_TESUTURI_COMPOZITE","HEMORAGII_DIGESTIVE_GASTROENTEROLOGIE_INTERVENTIONALA","GINECO_ONCOLOGIE"]
["CHIRURGIE_GENERALA_4","ARSI","ATI","CHIRURGIE_ENDOSCOPICA","CHIRURGIE_HEPATICA","CHIRURGIE_LAPAROSCOPICA","CHIRURGIE_MAXILO_FACIALA","CHIRURGIE_ONCOLOGICA_","CHIRURGIE_ORALA_SI_MAXILO_FACIALA","CHIRURGIE_PEDIATRICA","CHIRURGIE_PLASTICA_MICROCHIRURGIE_RECONSTRUCTIVA","CHIRURGIE_REPARATORIE_A_PICIORULUI_DIABETIC","CHIRURGIE_SI_ORTOPEDIE_INFANTILA_PEDIATRICA","CHIRURGIE_TORACICA","CHIRURGIE_TORACICA_SI_ESOFAGIANA","CHIRURGIE_VASCULARA","CRONICI","FLEBOLOGIE","NEUROCHIRURGIE","OBSTETRICA_GINECOLOGIE","OFTALMOLOGIE","ORL","ORTOPEDIE_SI_TRAUMATOLOGIE","TRANSPLANT_HEPATIC","UROLOGIE","GINECOLOGIE","CHIRURGIE_CARDIOVASCULARA","NEONATOLOGIE","TERAPIE_INTERMEDIARA_INGRIJIRE_POSTOPERATORIE_TIIP","SPRIJIN_POLITRAUMA","CHIRURGIE_ONCOLOGIE_MULTIVISCERALA","TRANSPLANT_TESUTURI_COMPOZITE","HEMORAGII_DIGESTIVE_GASTROENTEROLOGIE_INTERVENTIONALA","GINECO_ONCOLOGIE"]
["CHIRURGIE_GENERALA_5","ARSI","ATI","CHIRURGIE_ENDOSCOPICA","CHIRURGIE_HEPATICA","CHIRURGIE_LAPAROSCOPICA","CHIRURGIE_MAXILO_FACIALA","CHIRURGIE_ONCOLOGICA_","CHIRURGIE_ORALA_SI_MAXILO_FACIALA","CHIRURGIE_PEDIATRICA","CHIRURGIE_PLASTICA_MICROCHIRURGIE_RECONSTRUCTIVA","CHIRURGIE_REPARATORIE_A_PICIORULUI_DIABETIC","CHIRURGIE_SI_ORTOPEDIE_INFANTILA_PEDIATRICA","CHIRURGIE_TORACICA","CHIRURGIE_TORACICA_SI_ESOFAGIANA","CHIRURGIE_VASCULARA","CRONICI","FLEBOLOGIE","NEUROCHIRURGIE","OBSTETRICA_GINECOLOGIE","OFTALMOLOGIE","ORL","ORTOPEDIE_SI_TRAUMATOLOGIE","TRANSPLANT_HEPATIC","UROLOGIE","GINECOLOGIE","CHIRURGIE_CARDIOVASCULARA","NEONATOLOGIE","TERAPIE_INTERMEDIARA_INGRIJIRE_POSTOPERATORIE_TIIP","SPRIJIN_POLITRAUMA","CHIRURGIE_ONCOLOGIE_MULTIVISCERALA","TRANSPLANT_TESUTURI_COMPOZITE","HEMORAGII_DIGESTIVE_GASTROENTEROLOGIE_INTERVENTIONALA","GINECO_ONCOLOGIE"]
["CHIRURGIE_LAPAROSCOPICA_1"]
["CHIRURGIE_LAPAROSCOPICA_2"]
["CHIRURGIE_ONCOLOGICA_1","CHIRURGIE_ONCOLOGICA_COPII","CHIRURGIE_ORALA_SI_MAXILO_FACIALA","CHIRURGIE_PLASTICA_MICROCHIRURGIE_RECONSTRUCTIVA","CHIRURGIE_TORACICA","GINECOLOGIE","GINECO_ONCOLOGIE","UROLOGIE","ORL"]
["CHIRURGIE_ONCOLOGICA_2","CHIRURGIE_ONCOLOGICA_COPII","CHIRURGIE_ORALA_SI_MAXILO_FACIALA","CHIRURGIE_PLASTICA_MICROCHIRURGIE_RECONSTRUCTIVA","CHIRURGIE_TORACICA","GINECOLOGIE","GINECO_ONCOLOGIE","UROLOGIE","ORL"]
["CHIRURGIE_ONCOLOGICA_3","CHIRURGIE_ONCOLOGICA_COPII","CHIRURGIE_ORALA_SI_MAXILO_FACIALA","CHIRURGIE_PLASTICA_MICROCHIRURGIE_RECONSTRUCTIVA","CHIRURGIE_TORACICA","GINECOLOGIE","GINECO_ONCOLOGIE","UROLOGIE","ORL"]
["CHIRURGIE_ONCOLOGICA_ORL_CHIRURGIE_CERVICO_FACIALA_SI_ONCOLOGIE_LARINGIANA"]
["CHIRURGIE_ORALA_SI_MAXILO_FACIALA_1","ATI","CHIRURGIE_ORALA_SI_MAXILO_FACIALA_COPII","CHIRURGIE_PLASTICA_MICROCHIRURGIE_RECONSTRUCTIVA","CHIRURGIE_PLASTICA_SI_REPARATORIE_FACIALA","ORL"]
["CHIRURGIE_ORALA_SI_MAXILO_FACIALA_2","ATI","CHIRURGIE_ORALA_SI_MAXILO_FACIALA_COPII","CHIRURGIE_PLASTICA_MICROCHIRURGIE_RECONSTRUCTIVA","CHIRURGIE_PLASTICA_SI_REPARATORIE_FACIALA","ORL"]
["CHIRURGIE_ORALA_SI_MAXILO_FACIALA_3","ATI","CHIRURGIE_ORALA_SI_MAXILO_FACIALA_COPII","CHIRURGIE_PLASTICA_MICROCHIRURGIE_RECONSTRUCTIVA","CHIRURGIE_PLASTICA_SI_REPARATORIE_FACIALA","ORL"]
["CHIRURGIE_ORALA_SI_MAXILO_FACIALA_4","ATI","CHIRURGIE_ORALA_SI_MAXILO_FACIALA_COPII","CHIRURGIE_PLASTICA_MICROCHIRURGIE_RECONSTRUCTIVA","CHIRURGIE_PLASTICA_SI_REPARATORIE_FACIALA","ORL"]
["CHIRURGIE_ORALA_SI_MAXILO_FACIALA_5","ATI","CHIRURGIE_ORALA_SI_MAXILO_FACIALA_COPII","CHIRURGIE_PLASTICA_MICROCHIRURGIE_RECONSTRUCTIVA","CHIRURGIE_PLASTICA_SI_REPARATORIE_FACIALA","ORL"]
["CHIRURGIE_PEDIATRICA_1","ATI","CHIRURGIE_CARDIOVASCULARA","NEUROCHIRURGIE","OFTALMOLOGIE","ORL","ORTOPEDIE_PEDIATRICA","UROLOGIE","ARSI_COPII","CHIRURGIE_ORALA_SI_MAXILO_FACIALA","CHIRURGIE_PLASTICA_MICROCHIRURGIE_RECONSTRUCTIVA_SI_ARSI"]
["CHIRURGIE_PEDIATRICA_2","ATI","CHIRURGIE_CARDIOVASCULARA","NEUROCHIRURGIE","OFTALMOLOGIE","ORL","ORTOPEDIE_PEDIATRICA","UROLOGIE","ARSI_COPII","CHIRURGIE_ORALA_SI_MAXILO_FACIALA","CHIRURGIE_PLASTICA_MICROCHIRURGIE_RECONSTRUCTIVA_SI_ARSI"]
["CHIRURGIE_PLASTICA_MICROCHIRURGIE_RECONSTRUCTIVA_ARSI_1","ATI","TERAPIE_INTERMEDIARA_INGRIJIRE_POSTOPERATORIE_TIIP","UNITATE_FUNCTIONALA_PENTRU_ARSI"]
["CHIRURGIE_PLASTICA_MICROCHIRURGIE_RECONSTRUCTIVA_ARSI_2","ATI","TERAPIE_INTERMEDIARA_INGRIJIRE_POSTOPERATORIE_TIIP","UNITATE_FUNCTIONALA_PENTRU_ARSI"]
["CHIRURGIE_PLASTICA_MICROCHIRURGIE_RECONSTRUCTIVA_COPII_1","ARSI","ATI"]
["CHIRURGIE_PLASTICA_MICROCHIRURGIE_RECONSTRUCTIVA_COPII_2","ARSI","ATI"]
["CHIRURGIE_PLASTICA_MICROCHIRURGIE_RECONSTRUCTIVA","ARSI","ATI","TI"]
["CHIRURGIE_SI_ORTOPEDIE_INFANTILA_PEDIATRICA","CHIRURGIE_PLASTICA_MICROCHIRURGIE_RECONSTRUCTIVA","OFTALMOLOGIE","ORL","ORTOPEDIE_PEDIATRICA","NEUROCHIRURGIE","ARSI_COPII","CHIRURGIE_ORALA_SI_MAXILO_FACIALA","UROLOGIE_COPII"]
["CHIRURGIE_TORACICA_TBC","ATI"]
["CHIRURGIE_TORACICA","ATI"]
["CHIRURGIE_VASCULARA","MICROCHIRURGIE_VASCULARA"]
["CRONICI_AFECTIUNI_PSIHOSOMATICE"]
["CRONICI_TERAPIE_IZOTOPICA"]
["CRONICI_1","GERIATRIE_SI_GERONTOLOGIE","INGRIJIRI_PALIATIVE","RECUPERARE_NEUROLOGICA","REUMATOLOGIE_"]
["CRONICI_2","GERIATRIE_SI_GERONTOLOGIE","INGRIJIRI_PALIATIVE","RECUPERARE_NEUROLOGICA","REUMATOLOGIE_"]
["DERMATOVENEROLOGIE_1","ALERGOLOGIE_SI_IMUNOLOGIE","DERMATOVENEROLOGIE_COPII","PARAZITOLOGIE","BOLI_CRONICE"]
["DERMATOVENEROLOGIE_2","ALERGOLOGIE_SI_IMUNOLOGIE","DERMATOVENEROLOGIE_COPII","PARAZITOLOGIE","BOLI_CRONICE"]
["DERMATOVENEROLOGIE_3","ALERGOLOGIE_SI_IMUNOLOGIE","DERMATOVENEROLOGIE_COPII","PARAZITOLOGIE","BOLI_CRONICE"]
["DERMATOVENEROLOGIE_COPII_1"]
["DIABET_ZAHARAT_NUTRITIE_SI_BOLI_METABOLICE_1","DERMATOVENEROLOGIE","ENDOCRINOLOGIE","TA","MEDICINA_INTERNA","HEMATOLOGIE"]
["DIABET_ZAHARAT_NUTRITIE_SI_BOLI_METABOLICE_2","DERMATOVENEROLOGIE","ENDOCRINOLOGIE","TA","MEDICINA_INTERNA","HEMATOLOGIE"]
["DIABET_ZAHARAT_NUTRITIE_SI_BOLI_METABOLICE_3","DERMATOVENEROLOGIE","ENDOCRINOLOGIE","TA","MEDICINA_INTERNA","HEMATOLOGIE"]
["DIABET_ZAHARAT_NUTRITIE_SI_BOLI_METABOLICE_COPII"]
["DIALIZA_PERITONEALA"]
["ENDOCRINOLOGIE_1","DIABET_ZAHARAT_NUTRITIE_SI_BOLI_METABOLICE","ENDOCRINOLOGIE_COPII","GUSA_ENDEMICA_SI_COMPLICATIILE_EI","INFERTILITATE_SI_PATOLOGIE_GONADICA","PATOLOGIA_TIROIDEI_DE_CORELATIE","PATOLOGIE_ENDOCRINO_METABOLICA","PATOLOGIE_HIPOFIZARA_SI_NEUROENDOCRINA","PATOLOGIE_SUPRARENALA_SI_A_METABOLISMULUI_OSOS","ONCOLOGIE_MEDICALA"]
["ENDOCRINOLOGIE_2","DIABET_ZAHARAT_NUTRITIE_SI_BOLI_METABOLICE","ENDOCRINOLOGIE_COPII","GUSA_ENDEMICA_SI_COMPLICATIILE_EI","INFERTILITATE_SI_PATOLOGIE_GONADICA","PATOLOGIA_TIROIDEI_DE_CORELATIE","PATOLOGIE_ENDOCRINO_METABOLICA","PATOLOGIE_HIPOFIZARA_SI_NEUROENDOCRINA","PATOLOGIE_SUPRARENALA_SI_A_METABOLISMULUI_OSOS","ONCOLOGIE_MEDICALA"]
["ENDOCRINOLOGIE_3","DIABET_ZAHARAT_NUTRITIE_SI_BOLI_METABOLICE","ENDOCRINOLOGIE_COPII","GUSA_ENDEMICA_SI_COMPLICATIILE_EI","INFERTILITATE_SI_PATOLOGIE_GONADICA","PATOLOGIA_TIROIDEI_DE_CORELATIE","PATOLOGIE_ENDOCRINO_METABOLICA","PATOLOGIE_HIPOFIZARA_SI_NEUROENDOCRINA","PATOLOGIE_SUPRARENALA_SI_A_METABOLISMULUI_OSOS","ONCOLOGIE_MEDICALA"]
["ENDOCRINOLOGIE_4","DIABET_ZAHARAT_NUTRITIE_SI_BOLI_METABOLICE","ENDOCRINOLOGIE_COPII","GUSA_ENDEMICA_SI_COMPLICATIILE_EI","INFERTILITATE_SI_PATOLOGIE_GONADICA","PATOLOGIA_TIROIDEI_DE_CORELATIE","PATOLOGIE_ENDOCRINO_METABOLICA","PATOLOGIE_HIPOFIZARA_SI_NEUROENDOCRINA","PATOLOGIE_SUPRARENALA_SI_A_METABOLISMULUI_OSOS","ONCOLOGIE_MEDICALA"]
["ENDOCRINOLOGIE_5","DIABET_ZAHARAT_NUTRITIE_SI_BOLI_METABOLICE","ENDOCRINOLOGIE_COPII","GUSA_ENDEMICA_SI_COMPLICATIILE_EI","INFERTILITATE_SI_PATOLOGIE_GONADICA","PATOLOGIA_TIROIDEI_DE_CORELATIE","PATOLOGIE_ENDOCRINO_METABOLICA","PATOLOGIE_HIPOFIZARA_SI_NEUROENDOCRINA","PATOLOGIE_SUPRARENALA_SI_A_METABOLISMULUI_OSOS","ONCOLOGIE_MEDICALA"]
["ENDOCRINOLOGIE_6","DIABET_ZAHARAT_NUTRITIE_SI_BOLI_METABOLICE","ENDOCRINOLOGIE_COPII","GUSA_ENDEMICA_SI_COMPLICATIILE_EI","INFERTILITATE_SI_PATOLOGIE_GONADICA","PATOLOGIA_TIROIDEI_DE_CORELATIE","PATOLOGIE_ENDOCRINO_METABOLICA","PATOLOGIE_HIPOFIZARA_SI_NEUROENDOCRINA","PATOLOGIE_SUPRARENALA_SI_A_METABOLISMULUI_OSOS","ONCOLOGIE_MEDICALA"]
["ENDOCRINOLOGIE_7","DIABET_ZAHARAT_NUTRITIE_SI_BOLI_METABOLICE","ENDOCRINOLOGIE_COPII","GUSA_ENDEMICA_SI_COMPLICATIILE_EI","INFERTILITATE_SI_PATOLOGIE_GONADICA","PATOLOGIA_TIROIDEI_DE_CORELATIE","PATOLOGIE_ENDOCRINO_METABOLICA","PATOLOGIE_HIPOFIZARA_SI_NEUROENDOCRINA","PATOLOGIE_SUPRARENALA_SI_A_METABOLISMULUI_OSOS","ONCOLOGIE_MEDICALA"]
["ENDOCRINOLOGIE_COPII_1"]
["GASTROENTEROLOGIE_1","GASTROENTEROLOGIE_COPII","HEPATOLOGIE","TA","ONCOLOGIE_DIGESTIVA","MEDICINA_INTERNA","DIABET_ZAHARAT_NUTRITIE_SI_BOLI_METABOLICE","ENDOCRINOLOGIE"]
["GASTROENTEROLOGIE_2","GASTROENTEROLOGIE_COPII","HEPATOLOGIE","TA","ONCOLOGIE_DIGESTIVA","MEDICINA_INTERNA","DIABET_ZAHARAT_NUTRITIE_SI_BOLI_METABOLICE","ENDOCRINOLOGIE"]
["GASTROENTEROLOGIE_COPII_1","DIABET_ZAHARAT_NUTRITIE_SI_BOLI_METABOLICE_COPII","ENDOCRINOLOGIE_COPII"]
["GASTROENTEROLOGIE_HEPATOLOGIE","ONCOLOGIE_MEDICALA"]
["GENETICA_MEDICALA"]
["GERIATRIE_SI_GERONTOLOGIE_1","PSIHOGERIATRIE"]
["GERIATRIE_SI_GERONTOLOGIE_2","PSIHOGERIATRIE"]
["GERIATRIE_SI_GERONTOLOGIE_3","PSIHOGERIATRIE"]
["GERIATRIE_SI_GERONTOLOGIE_4","PSIHOGERIATRIE"]
["GINECOLOGIE_1","CHIRURGIE_LAPAROSCOPICA_GINECOLOGICA","GINECO_ONCOLOGIE"]
["GINECOLOGIE_2","CHIRURGIE_LAPAROSCOPICA_GINECOLOGICA","GINECO_ONCOLOGIE"]
["GINECOLOGIE_INFANTILA"]
["HEMATOLOGIE_1","HEMATOLOGIE_COPII","TRANSPLANT_MEDULAR","TRANSPLANT_MEDULAR_ADULTI_SI_COPII","TA"]
["HEMATOLOGIE_2","HEMATOLOGIE_COPII","TRANSPLANT_MEDULAR","TRANSPLANT_MEDULAR_ADULTI_SI_COPII","TA"]
["HEMATOLOGIE_3","HEMATOLOGIE_COPII","TRANSPLANT_MEDULAR","TRANSPLANT_MEDULAR_ADULTI_SI_COPII","TA"]
["HEMATOLOGIE_4","HEMATOLOGIE_COPII","TRANSPLANT_MEDULAR","TRANSPLANT_MEDULAR_ADULTI_SI_COPII","TA"]
["HEMATOLOGIE_5","HEMATOLOGIE_COPII","TRANSPLANT_MEDULAR","TRANSPLANT_MEDULAR_ADULTI_SI_COPII","TA"]
["HEMATOLOGIE_6","HEMATOLOGIE_COPII","TRANSPLANT_MEDULAR","TRANSPLANT_MEDULAR_ADULTI_SI_COPII","TA"]
["HEMATOLOGIE_HEMOFILIE","TA"]
["HEMATOLOGIE_ONCOLOGIE_PEDIATRICA"]
["HIV_SIDA"]
["INGRIJIRI_PALIATIVE"]
["INGRIJIRI_PALIATIVE_COPII"]
["MEDICINA_GENERALA"]
["MEDICINA_INTERNA_CRONICI","BOLI_PROFESIONALE"]
["MEDICINA_INTERNA_1","ALERGOLOGIE_SI_IMUNOLOGIE","BOLI_PROFESIONALE","CARDIOLOGIE","CRONICI","DERMATOVENEROLOGIE","DIABET_ZAHARAT_NUTRITIE_SI_BOLI_METABOLICE","DIALIZA_PERITONEALA","ENDOCRINOLOGIE","GASTROENTEROLOGIE","GERIATRIE_SI_GERONTOLOGIE","HEMATOLOGIE","MEDICINA_INTERNA_CRONICI","NEFROLOGIE","NEUROLOGIE","NEUROLOGIE_CRONICI","ONCOLOGIE_MEDICALA","PNEUMOLOGIE_DIN_SECTIILE_MEDICALE","RECUPERARE_MEDICINA_FIZICA_SI_BALNEOLOGIE","RECUPERARE_MEDICALA","RECUPERARE_RESPIRATORIE","REUMATOLOGIE","TA","TI_CORONARIENI","TI","INGRIJIRI_PALIATIVE","RECUPERARE_MEDICALA_RESPIRATORIE"]
["MEDICINA_INTERNA_2","ALERGOLOGIE_SI_IMUNOLOGIE","BOLI_PROFESIONALE","CARDIOLOGIE","CRONICI","DERMATOVENEROLOGIE","DIABET_ZAHARAT_NUTRITIE_SI_BOLI_METABOLICE","DIALIZA_PERITONEALA","ENDOCRINOLOGIE","GASTROENTEROLOGIE","GERIATRIE_SI_GERONTOLOGIE","HEMATOLOGIE","MEDICINA_INTERNA_CRONICI","NEFROLOGIE","NEUROLOGIE","NEUROLOGIE_CRONICI","ONCOLOGIE_MEDICALA","PNEUMOLOGIE_DIN_SECTIILE_MEDICALE","RECUPERARE_MEDICINA_FIZICA_SI_BALNEOLOGIE","RECUPERARE_MEDICALA","RECUPERARE_RESPIRATORIE","REUMATOLOGIE","TA","TI_CORONARIENI","TI","INGRIJIRI_PALIATIVE","RECUPERARE_MEDICALA_RESPIRATORIE"]
["MEDICINA_INTERNA_3","ALERGOLOGIE_SI_IMUNOLOGIE","BOLI_PROFESIONALE","CARDIOLOGIE","CRONICI","DERMATOVENEROLOGIE","DIABET_ZAHARAT_NUTRITIE_SI_BOLI_METABOLICE","DIALIZA_PERITONEALA","ENDOCRINOLOGIE","GASTROENTEROLOGIE","GERIATRIE_SI_GERONTOLOGIE","HEMATOLOGIE","MEDICINA_INTERNA_CRONICI","NEFROLOGIE","NEUROLOGIE","NEUROLOGIE_CRONICI","ONCOLOGIE_MEDICALA","PNEUMOLOGIE_DIN_SECTIILE_MEDICALE","RECUPERARE_MEDICINA_FIZICA_SI_BALNEOLOGIE","RECUPERARE_MEDICALA","RECUPERARE_RESPIRATORIE","REUMATOLOGIE","TA","TI_CORONARIENI","TI","INGRIJIRI_PALIATIVE","RECUPERARE_MEDICALA_RESPIRATORIE"]
["MEDICINA_MATERNO_FETALA"]
["NEFROLOGIE_1","ALERGOLOGIE_SI_IMUNOLOGIE","CRONICI","DIALIZA_PERITONEALA","HEMODIALIZA","MEDICINA_INTERNA","TA","TI","TOXICOLOGIE"]
["NEFROLOGIE_2","ALERGOLOGIE_SI_IMUNOLOGIE","CRONICI","DIALIZA_PERITONEALA","HEMODIALIZA","MEDICINA_INTERNA","TA","TI","TOXICOLOGIE"]
["NEFROLOGIE_3","ALERGOLOGIE_SI_IMUNOLOGIE","CRONICI","DIALIZA_PERITONEALA","HEMODIALIZA","MEDICINA_INTERNA","TA","TI","TOXICOLOGIE"]
["NEFROLOGIE_PEDIATRICA","DIALIZA_PERITONEALA","TI","TA","TOXICOLOGIE"]
["NEFROLOGIE_PENTRU_DIABETICI","DIALIZA_PERITONEALA"]
["NEONATOLOGIE_1","PREMATURI","TA","TI"]
["NEONATOLOGIE_2","PREMATURI","TA","TI"]
["NEONATOLOGIE_PREMATURI","TI"]
["NEUROCHIRURGIE_STEREOTACTICA_SI_FUNCTIONALA"]
["NEUROCHIRURGIE_1","ATI","CHIRURGIE_SPINALA","CRONICI","NEUROCHIRURGIE_PEDIATRICA_COPII"]
["NEUROCHIRURGIE_2","ATI","CHIRURGIE_SPINALA","CRONICI","NEUROCHIRURGIE_PEDIATRICA_COPII"]
["NEUROCHIRURGIE_3","ATI","CHIRURGIE_SPINALA","CRONICI","NEUROCHIRURGIE_PEDIATRICA_COPII"]
["NEUROCHIRURGIE_4","ATI","CHIRURGIE_SPINALA","CRONICI","NEUROCHIRURGIE_PEDIATRICA_COPII"]
["NEUROCHIRURGIE_5","ATI","CHIRURGIE_SPINALA","CRONICI","NEUROCHIRURGIE_PEDIATRICA_COPII"]
["NEUROLOGIE_1","CRONICI","PENTRU_BOLNAVI_CU_MIASTENIA_GRAVIS","RECUPERARE_CRONICI","RECUPERARE_NEUROLOGICA","RECUPERARE_NEUROMOTORIE","TA","TI","URGENTE_NEUROVASCULARE","UAVCA","NEUROLOGIE_CRONICI"]
["NEUROLOGIE_2","CRONICI","PENTRU_BOLNAVI_CU_MIASTENIA_GRAVIS","RECUPERARE_CRONICI","RECUPERARE_NEUROLOGICA","RECUPERARE_NEUROMOTORIE","TA","TI","URGENTE_NEUROVASCULARE","UAVCA","NEUROLOGIE_CRONICI"]
["NEUROLOGIE_CRONICI"]
["NEUROLOGIE_PEDIATRICA","PSIHIATRIE_PEDIATRICA","RECUPERARE_NEUROPSIHOMOTORIE","TA","TOXICOLOGIE","RECUPERARE_NEUROLOGICA_PEDIATRICA"]
["NEUROLOGIE_SI_PSIHIATRIE"]
["NEUROPSIHIATRIE_ADULTI"]
["NEUROPSIHIATRIE_INFANTILA","RECUPERARE_NEUROPSIHOMOTORIE_COPII","COPII_ART_110_COD_PENAL"]
["OBSTETRICA_1","MEDICINA_MATERNO_FETALA","OBSTETRICA_PATOLOGICA"]
["OBSTETRICA_2","MEDICINA_MATERNO_FETALA","OBSTETRICA_PATOLOGICA"]
["OBSTETRICA_3","MEDICINA_MATERNO_FETALA","OBSTETRICA_PATOLOGICA"]
["OBSTETRICA_4","MEDICINA_MATERNO_FETALA","OBSTETRICA_PATOLOGICA"]
["OBSTETRICA_FIZIOLOGICA","NEONATOLOGIE"]
["OBSTETRICA_GINECOLOGIE_1","ATI","BOLI_CRONICE","CHIRURGIE_ONCOLOGICA","FERTILIZARE_IN_VITRO","GINECOLOGIE","GINECO_ONCOLOGIE","MEDICINA_MATERNO_FETALA","NASTERI_PRECIPITATE","NEONATOLOGIE","OBSTETRICA","OBSTETRICA_PATOLOGICA","PREMATURI","TI_NEONATOLOGIE","TRATAMENTUL_INFERTILITATII_CUPLULUI_SI_REPRODUCERE_UMANA_ASISTATA","GENETICA_MEDICALA","STERILITATE_SI_INFERTILITATE","URO_GINECOLOGIE","OBSTETRICA_PATOLOGICA_CRONICI"]
["OBSTETRICA_GINECOLOGIE_2","ATI","BOLI_CRONICE","CHIRURGIE_ONCOLOGICA","FERTILIZARE_IN_VITRO","GINECOLOGIE","GINECO_ONCOLOGIE","MEDICINA_MATERNO_FETALA","NASTERI_PRECIPITATE","NEONATOLOGIE","OBSTETRICA","OBSTETRICA_PATOLOGICA","PREMATURI","TI_NEONATOLOGIE","TRATAMENTUL_INFERTILITATII_CUPLULUI_SI_REPRODUCERE_UMANA_ASISTATA","GENETICA_MEDICALA","STERILITATE_SI_INFERTILITATE","URO_GINECOLOGIE","OBSTETRICA_PATOLOGICA_CRONICI"]
["OBSTETRICA_GINECOLOGIE_3","ATI","BOLI_CRONICE","CHIRURGIE_ONCOLOGICA","FERTILIZARE_IN_VITRO","GINECOLOGIE","GINECO_ONCOLOGIE","MEDICINA_MATERNO_FETALA","NASTERI_PRECIPITATE","NEONATOLOGIE","OBSTETRICA","OBSTETRICA_PATOLOGICA","PREMATURI","TI_NEONATOLOGIE","TRATAMENTUL_INFERTILITATII_CUPLULUI_SI_REPRODUCERE_UMANA_ASISTATA","GENETICA_MEDICALA","STERILITATE_SI_INFERTILITATE","URO_GINECOLOGIE","OBSTETRICA_PATOLOGICA_CRONICI"]
["OBSTETRICA_GINECOLOGIE_4","ATI","BOLI_CRONICE","CHIRURGIE_ONCOLOGICA","FERTILIZARE_IN_VITRO","GINECOLOGIE","GINECO_ONCOLOGIE","MEDICINA_MATERNO_FETALA","NASTERI_PRECIPITATE","NEONATOLOGIE","OBSTETRICA","OBSTETRICA_PATOLOGICA","PREMATURI","TI_NEONATOLOGIE","TRATAMENTUL_INFERTILITATII_CUPLULUI_SI_REPRODUCERE_UMANA_ASISTATA","GENETICA_MEDICALA","STERILITATE_SI_INFERTILITATE","URO_GINECOLOGIE","OBSTETRICA_PATOLOGICA_CRONICI"]
["OBSTETRICA_GINECOLOGIE_5","ATI","BOLI_CRONICE","CHIRURGIE_ONCOLOGICA","FERTILIZARE_IN_VITRO","GINECOLOGIE","GINECO_ONCOLOGIE","MEDICINA_MATERNO_FETALA","NASTERI_PRECIPITATE","NEONATOLOGIE","OBSTETRICA","OBSTETRICA_PATOLOGICA","PREMATURI","TI_NEONATOLOGIE","TRATAMENTUL_INFERTILITATII_CUPLULUI_SI_REPRODUCERE_UMANA_ASISTATA","GENETICA_MEDICALA","STERILITATE_SI_INFERTILITATE","URO_GINECOLOGIE","OBSTETRICA_PATOLOGICA_CRONICI"]
["OBSTETRICA_GINECOLOGIE_6","ATI","BOLI_CRONICE","CHIRURGIE_ONCOLOGICA","FERTILIZARE_IN_VITRO","GINECOLOGIE","GINECO_ONCOLOGIE","MEDICINA_MATERNO_FETALA","NASTERI_PRECIPITATE","NEONATOLOGIE","OBSTETRICA","OBSTETRICA_PATOLOGICA","PREMATURI","TI_NEONATOLOGIE","TRATAMENTUL_INFERTILITATII_CUPLULUI_SI_REPRODUCERE_UMANA_ASISTATA","GENETICA_MEDICALA","STERILITATE_SI_INFERTILITATE","URO_GINECOLOGIE","OBSTETRICA_PATOLOGICA_CRONICI"]
["OBSTETRICA_GINECOLOGIE_7","ATI","BOLI_CRONICE","CHIRURGIE_ONCOLOGICA","FERTILIZARE_IN_VITRO","GINECOLOGIE","GINECO_ONCOLOGIE","MEDICINA_MATERNO_FETALA","NASTERI_PRECIPITATE","NEONATOLOGIE","OBSTETRICA","OBSTETRICA_PATOLOGICA","PREMATURI","TI_NEONATOLOGIE","TRATAMENTUL_INFERTILITATII_CUPLULUI_SI_REPRODUCERE_UMANA_ASISTATA","GENETICA_MEDICALA","STERILITATE_SI_INFERTILITATE","URO_GINECOLOGIE","OBSTETRICA_PATOLOGICA_CRONICI"]
["OBSTETRICA_GINECOLOGIE_GRAVIDE_CU_RISC"]
["OBSTETRICA_GINECOLOGIE_NASTERI_PRECIPITATE","NEONATOLOGIE"]
["OBSTETRICA_GINECOLOGIE_PATOLOGICA"]
["OBSTETRICA_PATOLOGICA","STERILITATE_INFERTILITATE"]
["OFTALMOLOGIE_1","ATI","OFTALMOLOGIE_COPII"]
["OFTALMOLOGIE_2","ATI","OFTALMOLOGIE_COPII"]
["OFTALMOLOGIE_3","ATI","OFTALMOLOGIE_COPII"]
["OFTALMOLOGIE_COPII_1"]
["OFTALMOLOGIE_COPII_2"]
["OFTALMOLOGIE_COPII_3"]
["ONCOLOGIE_MEDICALA_INGRIJIRI_PALIATIVE_1"]
["ONCOLOGIE_MEDICALA_INGRIJIRI_PALIATIVE_2"]
["ONCOLOGIE_MEDICALA_1","HEMATOLOGIE","INGRIJIRI_PALIATIVE","RADIOTERAPIE","PNEUMOLOGIE_DIN_SECTIILE_MEDICALE_ONCOLOGIE","TERAPIE_CU_IZOTOPI","CRONICI"]
["ONCOLOGIE_MEDICALA_2","HEMATOLOGIE","INGRIJIRI_PALIATIVE","RADIOTERAPIE","PNEUMOLOGIE_DIN_SECTIILE_MEDICALE_ONCOLOGIE","TERAPIE_CU_IZOTOPI","CRONICI"]
["ONCOLOGIE_PEDIATRICA","HEMATOLOGIE","INGRIJIRI_PALIATIVE"]
["ONCOLOGIE_TERAPIE_CU_IZOTOPI"]
["ORL_CHIRURGIE_AUDIOLOGICA_SI_RINOLOGICA"]
["ORL_MICROCHIRURGIE_ORL_SI_FONIATRIE_RECUPERAREA_VOCII"]
["ORL_MICROCHIRURGIE_OTOLOGICA","IMPLANT_COHLEAR"]
["ORL","ATI","CHIRURGIE_MAXILO_FACIALA","CHIRURGIE_ORALA_SI_MAXILO_FACIALA","IMPLANT_COHLEAR","ORL_COPII"]
["ORL_COPII_1"]
["ORTOPEDIE_PEDIATRICA_1","RECUPERARE_MEDICALA_ORTOPEDIE_SI_TRAUMATOLOGIE_PEDIATRICA"]
["ORTOPEDIE_SI_TRAUMATOLOGIE_1","ATI","CHIRURGIE_ARTROSCOPICA","CHIRURGIE_SPINALA","ORTOPEDIE_PEDIATRICA","ORTOPEDIE_SI_TRAUMATOLOGIE_PEDIATRICA","RECUPERARE_CRONICI","RECUPERARE_MEDICALA","RECUPERARE_POSTTRAUMATICA","TI","TERAPIE_INTERMEDIARA_INGRIJIRE_POSTOPERATORIE_TIIP","CHIRURGIE_SI_ORTOPEDIE_INFANTILA_PEDIATRICA","RECUPERARE_MEDICALA_ORTOPEDIE_SI_TRAUMATOLOGIE","NEUROCHIRURGIE"]
["ORTOPEDIE_SI_TRAUMATOLOGIE_2","ATI","CHIRURGIE_ARTROSCOPICA","CHIRURGIE_SPINALA","ORTOPEDIE_PEDIATRICA","ORTOPEDIE_SI_TRAUMATOLOGIE_PEDIATRICA","RECUPERARE_CRONICI","RECUPERARE_MEDICALA","RECUPERARE_POSTTRAUMATICA","TI","TERAPIE_INTERMEDIARA_INGRIJIRE_POSTOPERATORIE_TIIP","CHIRURGIE_SI_ORTOPEDIE_INFANTILA_PEDIATRICA","RECUPERARE_MEDICALA_ORTOPEDIE_SI_TRAUMATOLOGIE","NEUROCHIRURGIE"]
["ORTOPEDIE_SI_TRAUMATOLOGIE_3","ATI","CHIRURGIE_ARTROSCOPICA","CHIRURGIE_SPINALA","ORTOPEDIE_PEDIATRICA","ORTOPEDIE_SI_TRAUMATOLOGIE_PEDIATRICA","RECUPERARE_CRONICI","RECUPERARE_MEDICALA","RECUPERARE_POSTTRAUMATICA","TI","TERAPIE_INTERMEDIARA_INGRIJIRE_POSTOPERATORIE_TIIP","CHIRURGIE_SI_ORTOPEDIE_INFANTILA_PEDIATRICA","RECUPERARE_MEDICALA_ORTOPEDIE_SI_TRAUMATOLOGIE","NEUROCHIRURGIE"]
["ORTOPEDIE_SI_TRAUMATOLOGIE_4","ATI","CHIRURGIE_ARTROSCOPICA","CHIRURGIE_SPINALA","ORTOPEDIE_PEDIATRICA","ORTOPEDIE_SI_TRAUMATOLOGIE_PEDIATRICA","RECUPERARE_CRONICI","RECUPERARE_MEDICALA","RECUPERARE_POSTTRAUMATICA","TI","TERAPIE_INTERMEDIARA_INGRIJIRE_POSTOPERATORIE_TIIP","CHIRURGIE_SI_ORTOPEDIE_INFANTILA_PEDIATRICA","RECUPERARE_MEDICALA_ORTOPEDIE_SI_TRAUMATOLOGIE","NEUROCHIRURGIE"]
["PATURI PENTRU PACIENTI COVID_1"]
["PATURI PENTRU PACIENTI COVID_2"]
["PATURI PENTRU PACIENTI COVID_3"]
["PATURI PENTRU PACIENTI COVID_4"]
["PATURI PENTRU PACIENTI COVID_5"]
["PATURI PENTRU PACIENTI COVID_COPII_1"]
["PATURI PENTRU PACIENTI COVID_COPII_2"]
["PATURI PENTRU PACIENTI COVID_COPII_3"]
["PATURI PENTRU PACIENTI COVID_COPII_4"]
["PEDIATRIE_1","ALERGOLOGIE_SI_IMUNOLOGIE","CARDIOLOGIE","CRONICI","DERMATOVENEROLOGIE","DIABET_ZAHARAT_NUTRITIE_SI_BOLI_METABOLICE","DIALIZA_PERITONEALA","ENDOCRINOLOGIE","GASTROENTEROLOGIE","GENETICA_MEDICALA","HEMATOLOGIE_ONCOLOGIE","HEMATOLOGIE_THALASEMII","HEMATOLOGIE","HIV_SIDA","NEFROLOGIE","NEONATOLOGIE_DIN_SECTIILE_DE_PEDIATRIE","NEONATOLOGIE_PATOLOGICA_DIN_SECTIILE_DE_PEDIATRIE","NEUROLOGIE_PEDIATRICA","NEUROPSIHIATRIE_INFANTILA","ONCOLOGIE_PEDIATRICA","PNEUMOLOGIE_DIN_SECTIILE_MEDICALE","PREMATURI_DIN_SECTIILE_DE_PEDIATRIE","PSIHIATRIE_PEDIATRICA","RECUPERARE_NEUROMOTORIE","RECUPERARE_NUTRITIONALA_SI_METABOLICA_A_SUGARULUI_SI_COPILULUI_MIC","RECUPERARE_PEDIATRICA_DISTROFICI","TA","TI","TOXICOLOGIE","TRANSPLANT_MEDULAR","BOLI_INFECTIOASE_COPII","REUMATOLOGIE","MEDICINA_RESPIRATORIE_PEDIATRICA","RECUPERARE_PEDIATRICA","INGRIJIRI_PALIATIVE"]
["PEDIATRIE_2","ALERGOLOGIE_SI_IMUNOLOGIE","CARDIOLOGIE","CRONICI","DERMATOVENEROLOGIE","DIABET_ZAHARAT_NUTRITIE_SI_BOLI_METABOLICE","DIALIZA_PERITONEALA","ENDOCRINOLOGIE","GASTROENTEROLOGIE","GENETICA_MEDICALA","HEMATOLOGIE_ONCOLOGIE","HEMATOLOGIE_THALASEMII","HEMATOLOGIE","HIV_SIDA","NEFROLOGIE","NEONATOLOGIE_DIN_SECTIILE_DE_PEDIATRIE","NEONATOLOGIE_PATOLOGICA_DIN_SECTIILE_DE_PEDIATRIE","NEUROLOGIE_PEDIATRICA","NEUROPSIHIATRIE_INFANTILA","ONCOLOGIE_PEDIATRICA","PNEUMOLOGIE_DIN_SECTIILE_MEDICALE","PREMATURI_DIN_SECTIILE_DE_PEDIATRIE","PSIHIATRIE_PEDIATRICA","RECUPERARE_NEUROMOTORIE","RECUPERARE_NUTRITIONALA_SI_METABOLICA_A_SUGARULUI_SI_COPILULUI_MIC","RECUPERARE_PEDIATRICA_DISTROFICI","TA","TI","TOXICOLOGIE","TRANSPLANT_MEDULAR","BOLI_INFECTIOASE_COPII","REUMATOLOGIE","MEDICINA_RESPIRATORIE_PEDIATRICA","RECUPERARE_PEDIATRICA","INGRIJIRI_PALIATIVE"]
["PEDIATRIE_3","ALERGOLOGIE_SI_IMUNOLOGIE","CARDIOLOGIE","CRONICI","DERMATOVENEROLOGIE","DIABET_ZAHARAT_NUTRITIE_SI_BOLI_METABOLICE","DIALIZA_PERITONEALA","ENDOCRINOLOGIE","GASTROENTEROLOGIE","GENETICA_MEDICALA","HEMATOLOGIE_ONCOLOGIE","HEMATOLOGIE_THALASEMII","HEMATOLOGIE","HIV_SIDA","NEFROLOGIE","NEONATOLOGIE_DIN_SECTIILE_DE_PEDIATRIE","NEONATOLOGIE_PATOLOGICA_DIN_SECTIILE_DE_PEDIATRIE","NEUROLOGIE_PEDIATRICA","NEUROPSIHIATRIE_INFANTILA","ONCOLOGIE_PEDIATRICA","PNEUMOLOGIE_DIN_SECTIILE_MEDICALE","PREMATURI_DIN_SECTIILE_DE_PEDIATRIE","PSIHIATRIE_PEDIATRICA","RECUPERARE_NEUROMOTORIE","RECUPERARE_NUTRITIONALA_SI_METABOLICA_A_SUGARULUI_SI_COPILULUI_MIC","RECUPERARE_PEDIATRICA_DISTROFICI","TA","TI","TOXICOLOGIE","TRANSPLANT_MEDULAR","BOLI_INFECTIOASE_COPII","REUMATOLOGIE","MEDICINA_RESPIRATORIE_PEDIATRICA","RECUPERARE_PEDIATRICA","INGRIJIRI_PALIATIVE"]
["PEDIATRIE_4","ALERGOLOGIE_SI_IMUNOLOGIE","CARDIOLOGIE","CRONICI","DERMATOVENEROLOGIE","DIABET_ZAHARAT_NUTRITIE_SI_BOLI_METABOLICE","DIALIZA_PERITONEALA","ENDOCRINOLOGIE","GASTROENTEROLOGIE","GENETICA_MEDICALA","HEMATOLOGIE_ONCOLOGIE","HEMATOLOGIE_THALASEMII","HEMATOLOGIE","HIV_SIDA","NEFROLOGIE","NEONATOLOGIE_DIN_SECTIILE_DE_PEDIATRIE","NEONATOLOGIE_PATOLOGICA_DIN_SECTIILE_DE_PEDIATRIE","NEUROLOGIE_PEDIATRICA","NEUROPSIHIATRIE_INFANTILA","ONCOLOGIE_PEDIATRICA","PNEUMOLOGIE_DIN_SECTIILE_MEDICALE","PREMATURI_DIN_SECTIILE_DE_PEDIATRIE","PSIHIATRIE_PEDIATRICA","RECUPERARE_NEUROMOTORIE","RECUPERARE_NUTRITIONALA_SI_METABOLICA_A_SUGARULUI_SI_COPILULUI_MIC","RECUPERARE_PEDIATRICA_DISTROFICI","TA","TI","TOXICOLOGIE","TRANSPLANT_MEDULAR","BOLI_INFECTIOASE_COPII","REUMATOLOGIE","MEDICINA_RESPIRATORIE_PEDIATRICA","RECUPERARE_PEDIATRICA","INGRIJIRI_PALIATIVE"]
["PEDIATRIE_5","ALERGOLOGIE_SI_IMUNOLOGIE","CARDIOLOGIE","CRONICI","DERMATOVENEROLOGIE","DIABET_ZAHARAT_NUTRITIE_SI_BOLI_METABOLICE","DIALIZA_PERITONEALA","ENDOCRINOLOGIE","GASTROENTEROLOGIE","GENETICA_MEDICALA","HEMATOLOGIE_ONCOLOGIE","HEMATOLOGIE_THALASEMII","HEMATOLOGIE","HIV_SIDA","NEFROLOGIE","NEONATOLOGIE_DIN_SECTIILE_DE_PEDIATRIE","NEONATOLOGIE_PATOLOGICA_DIN_SECTIILE_DE_PEDIATRIE","NEUROLOGIE_PEDIATRICA","NEUROPSIHIATRIE_INFANTILA","ONCOLOGIE_PEDIATRICA","PNEUMOLOGIE_DIN_SECTIILE_MEDICALE","PREMATURI_DIN_SECTIILE_DE_PEDIATRIE","PSIHIATRIE_PEDIATRICA","RECUPERARE_NEUROMOTORIE","RECUPERARE_NUTRITIONALA_SI_METABOLICA_A_SUGARULUI_SI_COPILULUI_MIC","RECUPERARE_PEDIATRICA_DISTROFICI","TA","TI","TOXICOLOGIE","TRANSPLANT_MEDULAR","BOLI_INFECTIOASE_COPII","REUMATOLOGIE","MEDICINA_RESPIRATORIE_PEDIATRICA","RECUPERARE_PEDIATRICA","INGRIJIRI_PALIATIVE"]
["PEDIATRIE_6","ALERGOLOGIE_SI_IMUNOLOGIE","CARDIOLOGIE","CRONICI","DERMATOVENEROLOGIE","DIABET_ZAHARAT_NUTRITIE_SI_BOLI_METABOLICE","DIALIZA_PERITONEALA","ENDOCRINOLOGIE","GASTROENTEROLOGIE","GENETICA_MEDICALA","HEMATOLOGIE_ONCOLOGIE","HEMATOLOGIE_THALASEMII","HEMATOLOGIE","HIV_SIDA","NEFROLOGIE","NEONATOLOGIE_DIN_SECTIILE_DE_PEDIATRIE","NEONATOLOGIE_PATOLOGICA_DIN_SECTIILE_DE_PEDIATRIE","NEUROLOGIE_PEDIATRICA","NEUROPSIHIATRIE_INFANTILA","ONCOLOGIE_PEDIATRICA","PNEUMOLOGIE_DIN_SECTIILE_MEDICALE","PREMATURI_DIN_SECTIILE_DE_PEDIATRIE","PSIHIATRIE_PEDIATRICA","RECUPERARE_NEUROMOTORIE","RECUPERARE_NUTRITIONALA_SI_METABOLICA_A_SUGARULUI_SI_COPILULUI_MIC","RECUPERARE_PEDIATRICA_DISTROFICI","TA","TI","TOXICOLOGIE","TRANSPLANT_MEDULAR","BOLI_INFECTIOASE_COPII","REUMATOLOGIE","MEDICINA_RESPIRATORIE_PEDIATRICA","RECUPERARE_PEDIATRICA","INGRIJIRI_PALIATIVE"]
["PEDIATRIE_CRONICI"]
["PEDIATRIE_NEFROLOGIE","DIALIZA_PERITONEALA_COPII"]
["PEDIATRIE_RECUPERARE_PEDIATRICA"]
["PNEUMOLOGIE","PMEUMOLOGIE_CRONICI"]
["PNEUMOLOGIE_COPII_DIN_SECTIILE_TBC_1","PNEUMOLOGIE_TBC_COPII"]
["PNEUMOLOGIE_DIN_SECTIILE_MEDICALE","TI","TA","RECUPERARE_MEDICALA_RESPIRATORIE","CRONICI"]
["PNEUMOLOGIE_DIN_SECTIILE_MEDICALE_COPII"]
["PNEUMOLOGIE_DIN_SECTIILE_MEDICALE_CRONICI"]
["PNEUMOLOGIE_DIN_SECTIILE_TBC_1","PNEUMOLOGIE_COPII_DIN_SECTIILE_TBC","PNEUMOLOGIE_TBC","PNEUMOLOGIE_TBC_ADULTI","PNEUMOLOGIE_TBC_COPII","PNEUMOLOGIE_TBC_CRONICI","PNEUMOLOGIE_TBC_MDR_MULTIDROG_REZISTENTA","TA","TI","RECUPERARE_MEDICALA_RESPIRATORIE","PNEUMOLOGIE_DIN_SECTIILE_TBC_CRONICI","CRONICI","SOMNOLOGIE"]
["PNEUMOLOGIE_DIN_SECTIILE_TBC_2","PNEUMOLOGIE_COPII_DIN_SECTIILE_TBC","PNEUMOLOGIE_TBC","PNEUMOLOGIE_TBC_ADULTI","PNEUMOLOGIE_TBC_COPII","PNEUMOLOGIE_TBC_CRONICI","PNEUMOLOGIE_TBC_MDR_MULTIDROG_REZISTENTA","TA","TI","RECUPERARE_MEDICALA_RESPIRATORIE","PNEUMOLOGIE_DIN_SECTIILE_TBC_CRONICI","CRONICI","SOMNOLOGIE"]
["PNEUMOLOGIE_DIN_SECTIILE_TBC_3","PNEUMOLOGIE_COPII_DIN_SECTIILE_TBC","PNEUMOLOGIE_TBC","PNEUMOLOGIE_TBC_ADULTI","PNEUMOLOGIE_TBC_COPII","PNEUMOLOGIE_TBC_CRONICI","PNEUMOLOGIE_TBC_MDR_MULTIDROG_REZISTENTA","TA","TI","RECUPERARE_MEDICALA_RESPIRATORIE","PNEUMOLOGIE_DIN_SECTIILE_TBC_CRONICI","CRONICI","SOMNOLOGIE"]
["PNEUMOLOGIE_DIN_SECTIILE_TBC_4","PNEUMOLOGIE_COPII_DIN_SECTIILE_TBC","PNEUMOLOGIE_TBC","PNEUMOLOGIE_TBC_ADULTI","PNEUMOLOGIE_TBC_COPII","PNEUMOLOGIE_TBC_CRONICI","PNEUMOLOGIE_TBC_MDR_MULTIDROG_REZISTENTA","TA","TI","RECUPERARE_MEDICALA_RESPIRATORIE","PNEUMOLOGIE_DIN_SECTIILE_TBC_CRONICI","CRONICI","SOMNOLOGIE"]
["PNEUMOLOGIE_DIN_SECTIILE_TBC_5","PNEUMOLOGIE_COPII_DIN_SECTIILE_TBC","PNEUMOLOGIE_TBC","PNEUMOLOGIE_TBC_ADULTI","PNEUMOLOGIE_TBC_COPII","PNEUMOLOGIE_TBC_CRONICI","PNEUMOLOGIE_TBC_MDR_MULTIDROG_REZISTENTA","TA","TI","RECUPERARE_MEDICALA_RESPIRATORIE","PNEUMOLOGIE_DIN_SECTIILE_TBC_CRONICI","CRONICI","SOMNOLOGIE"]
["PNEUMOLOGIE_DIN_SECTIILE_TBC_6","PNEUMOLOGIE_COPII_DIN_SECTIILE_TBC","PNEUMOLOGIE_TBC","PNEUMOLOGIE_TBC_ADULTI","PNEUMOLOGIE_TBC_COPII","PNEUMOLOGIE_TBC_CRONICI","PNEUMOLOGIE_TBC_MDR_MULTIDROG_REZISTENTA","TA","TI","RECUPERARE_MEDICALA_RESPIRATORIE","PNEUMOLOGIE_DIN_SECTIILE_TBC_CRONICI","CRONICI","SOMNOLOGIE"]
["PNEUMOLOGIE_DIN_SECTIILE_TBC_7","PNEUMOLOGIE_COPII_DIN_SECTIILE_TBC","PNEUMOLOGIE_TBC","PNEUMOLOGIE_TBC_ADULTI","PNEUMOLOGIE_TBC_COPII","PNEUMOLOGIE_TBC_CRONICI","PNEUMOLOGIE_TBC_MDR_MULTIDROG_REZISTENTA","TA","TI","RECUPERARE_MEDICALA_RESPIRATORIE","PNEUMOLOGIE_DIN_SECTIILE_TBC_CRONICI","CRONICI","SOMNOLOGIE"]
["PNEUMOLOGIE_DIN_SECTIILE_TBC_8","PNEUMOLOGIE_COPII_DIN_SECTIILE_TBC","PNEUMOLOGIE_TBC","PNEUMOLOGIE_TBC_ADULTI","PNEUMOLOGIE_TBC_COPII","PNEUMOLOGIE_TBC_CRONICI","PNEUMOLOGIE_TBC_MDR_MULTIDROG_REZISTENTA","TA","TI","RECUPERARE_MEDICALA_RESPIRATORIE","PNEUMOLOGIE_DIN_SECTIILE_TBC_CRONICI","CRONICI","SOMNOLOGIE"]
["PNEUMOLOGIE_DIN_SECTIILE_TBC_9","PNEUMOLOGIE_COPII_DIN_SECTIILE_TBC","PNEUMOLOGIE_TBC","PNEUMOLOGIE_TBC_ADULTI","PNEUMOLOGIE_TBC_COPII","PNEUMOLOGIE_TBC_CRONICI","PNEUMOLOGIE_TBC_MDR_MULTIDROG_REZISTENTA","TA","TI","RECUPERARE_MEDICALA_RESPIRATORIE","PNEUMOLOGIE_DIN_SECTIILE_TBC_CRONICI","CRONICI","SOMNOLOGIE"]
["PNEUMOLOGIE_DIN_SECTIILE_TBC_10","PNEUMOLOGIE_COPII_DIN_SECTIILE_TBC","PNEUMOLOGIE_TBC","PNEUMOLOGIE_TBC_ADULTI","PNEUMOLOGIE_TBC_COPII","PNEUMOLOGIE_TBC_CRONICI","PNEUMOLOGIE_TBC_MDR_MULTIDROG_REZISTENTA","TA","TI","RECUPERARE_MEDICALA_RESPIRATORIE","PNEUMOLOGIE_DIN_SECTIILE_TBC_CRONICI","CRONICI","SOMNOLOGIE"]
["PNEUMOLOGIE_DIN_SECTIILE_TBC_11","PNEUMOLOGIE_COPII_DIN_SECTIILE_TBC","PNEUMOLOGIE_TBC","PNEUMOLOGIE_TBC_ADULTI","PNEUMOLOGIE_TBC_COPII","PNEUMOLOGIE_TBC_CRONICI","PNEUMOLOGIE_TBC_MDR_MULTIDROG_REZISTENTA","TA","TI","RECUPERARE_MEDICALA_RESPIRATORIE","PNEUMOLOGIE_DIN_SECTIILE_TBC_CRONICI","CRONICI","SOMNOLOGIE"]
["PNEUMOLOGIE_DIN_SECTIILE_TBC_12","PNEUMOLOGIE_COPII_DIN_SECTIILE_TBC","PNEUMOLOGIE_TBC","PNEUMOLOGIE_TBC_ADULTI","PNEUMOLOGIE_TBC_COPII","PNEUMOLOGIE_TBC_CRONICI","PNEUMOLOGIE_TBC_MDR_MULTIDROG_REZISTENTA","TA","TI","RECUPERARE_MEDICALA_RESPIRATORIE","PNEUMOLOGIE_DIN_SECTIILE_TBC_CRONICI","CRONICI","SOMNOLOGIE"]
["PNEUMOLOGIE_DIN_SECTIILE_TBC_COPII_1","PNEUMOLOGIE_TBC_COPII","PNEUMOLOGIE_DIN_SECTIILE_TBC_COPII_CRONICI","SOMNOLOGIE","RECUPERARE_MEDICALA_RESPIRATORIE","BOLI_INFECTIOASE_COPII"]
["PNEUMOLOGIE_DIN_SECTIILE_TBC_COPII_2","PNEUMOLOGIE_TBC_COPII","PNEUMOLOGIE_DIN_SECTIILE_TBC_COPII_CRONICI","SOMNOLOGIE","RECUPERARE_MEDICALA_RESPIRATORIE","BOLI_INFECTIOASE_COPII"]
["PNEUMOLOGIE_DIN_SECTIILE_TBC_CRONICI_1"]
["PNEUMOLOGIE_DIN_SECTIILE_TBC_CRONICI_2"]
["PNEUMOLOGIE_DIN_SECTIILE_TBC_CRONICI_3"]
["PNEUMOLOGIE_DIN_SECTIILE_TBC_CRONICI_4"]
["PNEUMOLOGIE_DIN_SECTIILE_TBC_CRONICI_5"]
["PNEUMOLOGIE_TBC_1","PNEUMOLOGIE_TBC_COPII","PNEUMOLOGIE_TBC_MDR_MULTIDROG_REZISTENTA","TI"]
["PNEUMOLOGIE_TBC_2","PNEUMOLOGIE_TBC_COPII","PNEUMOLOGIE_TBC_MDR_MULTIDROG_REZISTENTA","TI"]
["PNEUMOLOGIE_TBC_3","PNEUMOLOGIE_TBC_COPII","PNEUMOLOGIE_TBC_MDR_MULTIDROG_REZISTENTA","TI"]
["PNEUMOLOGIE_TBC_4","PNEUMOLOGIE_TBC_COPII","PNEUMOLOGIE_TBC_MDR_MULTIDROG_REZISTENTA","TI"]
["PNEUMOLOGIE_TBC_5","PNEUMOLOGIE_TBC_COPII","PNEUMOLOGIE_TBC_MDR_MULTIDROG_REZISTENTA","TI"]
["PNEUMOLOGIE_TBC_6","PNEUMOLOGIE_TBC_COPII","PNEUMOLOGIE_TBC_MDR_MULTIDROG_REZISTENTA","TI"]
["PNEUMOLOGIE_TBC_7","PNEUMOLOGIE_TBC_COPII","PNEUMOLOGIE_TBC_MDR_MULTIDROG_REZISTENTA","TI"]
["PNEUMOLOGIE_TBC_8","PNEUMOLOGIE_TBC_COPII","PNEUMOLOGIE_TBC_MDR_MULTIDROG_REZISTENTA","TI"]
["PNEUMOLOGIE_TBC_9","PNEUMOLOGIE_TBC_COPII","PNEUMOLOGIE_TBC_MDR_MULTIDROG_REZISTENTA","TI"]
["PNEUMOLOGIE_TBC_10","PNEUMOLOGIE_TBC_COPII","PNEUMOLOGIE_TBC_MDR_MULTIDROG_REZISTENTA","TI"]
["PNEUMOLOGIE_TBC_11","PNEUMOLOGIE_TBC_COPII","PNEUMOLOGIE_TBC_MDR_MULTIDROG_REZISTENTA","TI"]
["PNEUMOLOGIE_TBC_12","PNEUMOLOGIE_TBC_COPII","PNEUMOLOGIE_TBC_MDR_MULTIDROG_REZISTENTA","TI"]
["PNEUMOLOGIE_TBC_COPII_1"]
["PNEUMOLOGIE_TBC_CRONICI_1"]
["PNEUMOLOGIE_TBC_CRONICI_2"]
["PNEUMOLOGIE_TBC_CRONICI_3"]
["PNEUMOLOGIE_TBC_CRONICI_4"]
["PNEUMOLOGIE_TBC_CRONICI_5"]
["PNEUMOLOGIE_TBC_MDR_MULTIDROG_REZISTENTA_1"]
["PNEUMOLOGIE_TBC_MDR_MULTIDROG_REZISTENTA_2"]
["PNEUMOLOGIE_TBC_MDR_MULTIDROG_REZISTENTA_3"]
["PREMATURI_1"]
["PREMATURI_2"]
["PSIHIATRIE_1","BOLNAVI_PSIHICI_CU_TBC_PULMONAR_COD_PENAL","COD_PENAL","CRONICI_TERAPIE_OCUPATIONALA_SI_REABILITARE","INTERNARI_NEVOLUNTARE","NEVROZE","NEUROPSIHIATRIE_INFANTILA","POSTCURA_POLITOXICOMANIE_SI_ADICTII","POSTCURA_TOXICOMANIE","PSIHIATRIE_ACUTI","PSIHIATRIE_CRONICI","PSIHIATRIE_PEDIATRICA_COPII","PSIHOGERIATRIE","RECUPERARE_CRONICI","CURA_TOXICODEPENDENTE","URGENTE_PSIHIATRICE","INGRIJIRI_PALIATIVE"]
["PSIHIATRIE_2","BOLNAVI_PSIHICI_CU_TBC_PULMONAR_COD_PENAL","COD_PENAL","CRONICI_TERAPIE_OCUPATIONALA_SI_REABILITARE","INTERNARI_NEVOLUNTARE","NEVROZE","NEUROPSIHIATRIE_INFANTILA","POSTCURA_POLITOXICOMANIE_SI_ADICTII","POSTCURA_TOXICOMANIE","PSIHIATRIE_ACUTI","PSIHIATRIE_CRONICI","PSIHIATRIE_PEDIATRICA_COPII","PSIHOGERIATRIE","RECUPERARE_CRONICI","CURA_TOXICODEPENDENTE","URGENTE_PSIHIATRICE","INGRIJIRI_PALIATIVE"]
["PSIHIATRIE_3","BOLNAVI_PSIHICI_CU_TBC_PULMONAR_COD_PENAL","COD_PENAL","CRONICI_TERAPIE_OCUPATIONALA_SI_REABILITARE","INTERNARI_NEVOLUNTARE","NEVROZE","NEUROPSIHIATRIE_INFANTILA","POSTCURA_POLITOXICOMANIE_SI_ADICTII","POSTCURA_TOXICOMANIE","PSIHIATRIE_ACUTI","PSIHIATRIE_CRONICI","PSIHIATRIE_PEDIATRICA_COPII","PSIHOGERIATRIE","RECUPERARE_CRONICI","CURA_TOXICODEPENDENTE","URGENTE_PSIHIATRICE","INGRIJIRI_PALIATIVE"]
["PSIHIATRIE_ACUTI_1","ALCOOLISM","COD_PENAL","CURA_TOXICODEPENDENTE","NEUROPSIHIATRIE_INFANTILA","PSIHIATRIE","PSIHIATRIE_CRONICI","TOXICOMANIE","URGENTE_PSIHIATRICE","INGRIJIRI_PALIATIVE"]
["PSIHIATRIE_ACUTI_2","ALCOOLISM","COD_PENAL","CURA_TOXICODEPENDENTE","NEUROPSIHIATRIE_INFANTILA","PSIHIATRIE","PSIHIATRIE_CRONICI","TOXICOMANIE","URGENTE_PSIHIATRICE","INGRIJIRI_PALIATIVE"]
["PSIHIATRIE_ACUTI_3","ALCOOLISM","COD_PENAL","CURA_TOXICODEPENDENTE","NEUROPSIHIATRIE_INFANTILA","PSIHIATRIE","PSIHIATRIE_CRONICI","TOXICOMANIE","URGENTE_PSIHIATRICE","INGRIJIRI_PALIATIVE"]
["PSIHIATRIE_ACUTI_4","ALCOOLISM","COD_PENAL","CURA_TOXICODEPENDENTE","NEUROPSIHIATRIE_INFANTILA","PSIHIATRIE","PSIHIATRIE_CRONICI","TOXICOMANIE","URGENTE_PSIHIATRICE","INGRIJIRI_PALIATIVE"]
["PSIHIATRIE_ACUTI_5","ALCOOLISM","COD_PENAL","CURA_TOXICODEPENDENTE","NEUROPSIHIATRIE_INFANTILA","PSIHIATRIE","PSIHIATRIE_CRONICI","TOXICOMANIE","URGENTE_PSIHIATRICE","INGRIJIRI_PALIATIVE"]
["PSIHIATRIE_ACUTI_6","ALCOOLISM","COD_PENAL","CURA_TOXICODEPENDENTE","NEUROPSIHIATRIE_INFANTILA","PSIHIATRIE","PSIHIATRIE_CRONICI","TOXICOMANIE","URGENTE_PSIHIATRICE","INGRIJIRI_PALIATIVE"]
["PSIHIATRIE_ACUTI_7","ALCOOLISM","COD_PENAL","CURA_TOXICODEPENDENTE","NEUROPSIHIATRIE_INFANTILA","PSIHIATRIE","PSIHIATRIE_CRONICI","TOXICOMANIE","URGENTE_PSIHIATRICE","INGRIJIRI_PALIATIVE"]
["PSIHIATRIE_ACUTI_8","ALCOOLISM","COD_PENAL","CURA_TOXICODEPENDENTE","NEUROPSIHIATRIE_INFANTILA","PSIHIATRIE","PSIHIATRIE_CRONICI","TOXICOMANIE","URGENTE_PSIHIATRICE","INGRIJIRI_PALIATIVE"]
["PSIHIATRIE_ACUTI_9","ALCOOLISM","COD_PENAL","CURA_TOXICODEPENDENTE","NEUROPSIHIATRIE_INFANTILA","PSIHIATRIE","PSIHIATRIE_CRONICI","TOXICOMANIE","URGENTE_PSIHIATRICE","INGRIJIRI_PALIATIVE"]
["PSIHIATRIE_ACUTI_10","ALCOOLISM","COD_PENAL","CURA_TOXICODEPENDENTE","NEUROPSIHIATRIE_INFANTILA","PSIHIATRIE","PSIHIATRIE_CRONICI","TOXICOMANIE","URGENTE_PSIHIATRICE","INGRIJIRI_PALIATIVE"]
["PSIHIATRIE_ACUTI_11","ALCOOLISM","COD_PENAL","CURA_TOXICODEPENDENTE","NEUROPSIHIATRIE_INFANTILA","PSIHIATRIE","PSIHIATRIE_CRONICI","TOXICOMANIE","URGENTE_PSIHIATRICE","INGRIJIRI_PALIATIVE"]
["PSIHIATRIE_ACUTI_12","ALCOOLISM","COD_PENAL","CURA_TOXICODEPENDENTE","NEUROPSIHIATRIE_INFANTILA","PSIHIATRIE","PSIHIATRIE_CRONICI","TOXICOMANIE","URGENTE_PSIHIATRICE","INGRIJIRI_PALIATIVE"]
["PSIHIATRIE_ACUTI_13","ALCOOLISM","COD_PENAL","CURA_TOXICODEPENDENTE","NEUROPSIHIATRIE_INFANTILA","PSIHIATRIE","PSIHIATRIE_CRONICI","TOXICOMANIE","URGENTE_PSIHIATRICE","INGRIJIRI_PALIATIVE"]
["PSIHIATRIE_ACUTI_14","ALCOOLISM","COD_PENAL","CURA_TOXICODEPENDENTE","NEUROPSIHIATRIE_INFANTILA","PSIHIATRIE","PSIHIATRIE_CRONICI","TOXICOMANIE","URGENTE_PSIHIATRICE","INGRIJIRI_PALIATIVE"]
["PSIHIATRIE_ACUTI_15","ALCOOLISM","COD_PENAL","CURA_TOXICODEPENDENTE","NEUROPSIHIATRIE_INFANTILA","PSIHIATRIE","PSIHIATRIE_CRONICI","TOXICOMANIE","URGENTE_PSIHIATRICE","INGRIJIRI_PALIATIVE"]
["PSIHIATRIE_ACUTI_16","ALCOOLISM","COD_PENAL","CURA_TOXICODEPENDENTE","NEUROPSIHIATRIE_INFANTILA","PSIHIATRIE","PSIHIATRIE_CRONICI","TOXICOMANIE","URGENTE_PSIHIATRICE","INGRIJIRI_PALIATIVE"]
["PSIHIATRIE_CRONICI_COPII"]
["PSIHIATRIE_CRONICI_1","COD_PENAL","BOLNAVI_PSIHICI_CU_TBC_PULMONAR","BOLNAVI_PSIHICI_CU_TBC_PULMONAR_COD_PENAL","CRONICI_AFECTIUNI_PSIHOSOMATICE","DEMENTA_SENILA_SI_BOALA_ALZHEIMER","PSIHIATRIE_ACUTI","PSIHIATRIE_DEMENTE","PSIHIATRIE_PEDIATRICA_COPII","PSIHIATRIE","TERAPIE_OCUPATIONALA_SI_ERGOTERAPIE","INGRIJIRI_PALIATIVE","TOXICOMANIE"]
["PSIHIATRIE_CRONICI_2","COD_PENAL","BOLNAVI_PSIHICI_CU_TBC_PULMONAR","BOLNAVI_PSIHICI_CU_TBC_PULMONAR_COD_PENAL","CRONICI_AFECTIUNI_PSIHOSOMATICE","DEMENTA_SENILA_SI_BOALA_ALZHEIMER","PSIHIATRIE_ACUTI","PSIHIATRIE_DEMENTE","PSIHIATRIE_PEDIATRICA_COPII","PSIHIATRIE","TERAPIE_OCUPATIONALA_SI_ERGOTERAPIE","INGRIJIRI_PALIATIVE","TOXICOMANIE"]
["PSIHIATRIE_CRONICI_3","COD_PENAL","BOLNAVI_PSIHICI_CU_TBC_PULMONAR","BOLNAVI_PSIHICI_CU_TBC_PULMONAR_COD_PENAL","CRONICI_AFECTIUNI_PSIHOSOMATICE","DEMENTA_SENILA_SI_BOALA_ALZHEIMER","PSIHIATRIE_ACUTI","PSIHIATRIE_DEMENTE","PSIHIATRIE_PEDIATRICA_COPII","PSIHIATRIE","TERAPIE_OCUPATIONALA_SI_ERGOTERAPIE","INGRIJIRI_PALIATIVE","TOXICOMANIE"]
["PSIHIATRIE_CRONICI_4","COD_PENAL","BOLNAVI_PSIHICI_CU_TBC_PULMONAR","BOLNAVI_PSIHICI_CU_TBC_PULMONAR_COD_PENAL","CRONICI_AFECTIUNI_PSIHOSOMATICE","DEMENTA_SENILA_SI_BOALA_ALZHEIMER","PSIHIATRIE_ACUTI","PSIHIATRIE_DEMENTE","PSIHIATRIE_PEDIATRICA_COPII","PSIHIATRIE","TERAPIE_OCUPATIONALA_SI_ERGOTERAPIE","INGRIJIRI_PALIATIVE","TOXICOMANIE"]
["PSIHIATRIE_CRONICI_5","COD_PENAL","BOLNAVI_PSIHICI_CU_TBC_PULMONAR","BOLNAVI_PSIHICI_CU_TBC_PULMONAR_COD_PENAL","CRONICI_AFECTIUNI_PSIHOSOMATICE","DEMENTA_SENILA_SI_BOALA_ALZHEIMER","PSIHIATRIE_ACUTI","PSIHIATRIE_DEMENTE","PSIHIATRIE_PEDIATRICA_COPII","PSIHIATRIE","TERAPIE_OCUPATIONALA_SI_ERGOTERAPIE","INGRIJIRI_PALIATIVE","TOXICOMANIE"]
["PSIHIATRIE_CRONICI_6","COD_PENAL","BOLNAVI_PSIHICI_CU_TBC_PULMONAR","BOLNAVI_PSIHICI_CU_TBC_PULMONAR_COD_PENAL","CRONICI_AFECTIUNI_PSIHOSOMATICE","DEMENTA_SENILA_SI_BOALA_ALZHEIMER","PSIHIATRIE_ACUTI","PSIHIATRIE_DEMENTE","PSIHIATRIE_PEDIATRICA_COPII","PSIHIATRIE","TERAPIE_OCUPATIONALA_SI_ERGOTERAPIE","INGRIJIRI_PALIATIVE","TOXICOMANIE"]
["PSIHIATRIE_CRONICI_7","COD_PENAL","BOLNAVI_PSIHICI_CU_TBC_PULMONAR","BOLNAVI_PSIHICI_CU_TBC_PULMONAR_COD_PENAL","CRONICI_AFECTIUNI_PSIHOSOMATICE","DEMENTA_SENILA_SI_BOALA_ALZHEIMER","PSIHIATRIE_ACUTI","PSIHIATRIE_DEMENTE","PSIHIATRIE_PEDIATRICA_COPII","PSIHIATRIE","TERAPIE_OCUPATIONALA_SI_ERGOTERAPIE","INGRIJIRI_PALIATIVE","TOXICOMANIE"]
["PSIHIATRIE_CRONICI_8","COD_PENAL","BOLNAVI_PSIHICI_CU_TBC_PULMONAR","BOLNAVI_PSIHICI_CU_TBC_PULMONAR_COD_PENAL","CRONICI_AFECTIUNI_PSIHOSOMATICE","DEMENTA_SENILA_SI_BOALA_ALZHEIMER","PSIHIATRIE_ACUTI","PSIHIATRIE_DEMENTE","PSIHIATRIE_PEDIATRICA_COPII","PSIHIATRIE","TERAPIE_OCUPATIONALA_SI_ERGOTERAPIE","INGRIJIRI_PALIATIVE","TOXICOMANIE"]
["PSIHIATRIE_CRONICI_9","COD_PENAL","BOLNAVI_PSIHICI_CU_TBC_PULMONAR","BOLNAVI_PSIHICI_CU_TBC_PULMONAR_COD_PENAL","CRONICI_AFECTIUNI_PSIHOSOMATICE","DEMENTA_SENILA_SI_BOALA_ALZHEIMER","PSIHIATRIE_ACUTI","PSIHIATRIE_DEMENTE","PSIHIATRIE_PEDIATRICA_COPII","PSIHIATRIE","TERAPIE_OCUPATIONALA_SI_ERGOTERAPIE","INGRIJIRI_PALIATIVE","TOXICOMANIE"]
["PSIHIATRIE_CRONICI_10","COD_PENAL","BOLNAVI_PSIHICI_CU_TBC_PULMONAR","BOLNAVI_PSIHICI_CU_TBC_PULMONAR_COD_PENAL","CRONICI_AFECTIUNI_PSIHOSOMATICE","DEMENTA_SENILA_SI_BOALA_ALZHEIMER","PSIHIATRIE_ACUTI","PSIHIATRIE_DEMENTE","PSIHIATRIE_PEDIATRICA_COPII","PSIHIATRIE","TERAPIE_OCUPATIONALA_SI_ERGOTERAPIE","INGRIJIRI_PALIATIVE","TOXICOMANIE"]
["PSIHIATRIE_CRONICI_11","COD_PENAL","BOLNAVI_PSIHICI_CU_TBC_PULMONAR","BOLNAVI_PSIHICI_CU_TBC_PULMONAR_COD_PENAL","CRONICI_AFECTIUNI_PSIHOSOMATICE","DEMENTA_SENILA_SI_BOALA_ALZHEIMER","PSIHIATRIE_ACUTI","PSIHIATRIE_DEMENTE","PSIHIATRIE_PEDIATRICA_COPII","PSIHIATRIE","TERAPIE_OCUPATIONALA_SI_ERGOTERAPIE","INGRIJIRI_PALIATIVE","TOXICOMANIE"]
["PSIHIATRIE_CRONICI_12","COD_PENAL","BOLNAVI_PSIHICI_CU_TBC_PULMONAR","BOLNAVI_PSIHICI_CU_TBC_PULMONAR_COD_PENAL","CRONICI_AFECTIUNI_PSIHOSOMATICE","DEMENTA_SENILA_SI_BOALA_ALZHEIMER","PSIHIATRIE_ACUTI","PSIHIATRIE_DEMENTE","PSIHIATRIE_PEDIATRICA_COPII","PSIHIATRIE","TERAPIE_OCUPATIONALA_SI_ERGOTERAPIE","INGRIJIRI_PALIATIVE","TOXICOMANIE"]
["PSIHIATRIE_CRONICI_13","COD_PENAL","BOLNAVI_PSIHICI_CU_TBC_PULMONAR","BOLNAVI_PSIHICI_CU_TBC_PULMONAR_COD_PENAL","CRONICI_AFECTIUNI_PSIHOSOMATICE","DEMENTA_SENILA_SI_BOALA_ALZHEIMER","PSIHIATRIE_ACUTI","PSIHIATRIE_DEMENTE","PSIHIATRIE_PEDIATRICA_COPII","PSIHIATRIE","TERAPIE_OCUPATIONALA_SI_ERGOTERAPIE","INGRIJIRI_PALIATIVE","TOXICOMANIE"]
["PSIHIATRIE_CRONICI_14","COD_PENAL","BOLNAVI_PSIHICI_CU_TBC_PULMONAR","BOLNAVI_PSIHICI_CU_TBC_PULMONAR_COD_PENAL","CRONICI_AFECTIUNI_PSIHOSOMATICE","DEMENTA_SENILA_SI_BOALA_ALZHEIMER","PSIHIATRIE_ACUTI","PSIHIATRIE_DEMENTE","PSIHIATRIE_PEDIATRICA_COPII","PSIHIATRIE","TERAPIE_OCUPATIONALA_SI_ERGOTERAPIE","INGRIJIRI_PALIATIVE","TOXICOMANIE"]
["PSIHIATRIE_CRONICI_15","COD_PENAL","BOLNAVI_PSIHICI_CU_TBC_PULMONAR","BOLNAVI_PSIHICI_CU_TBC_PULMONAR_COD_PENAL","CRONICI_AFECTIUNI_PSIHOSOMATICE","DEMENTA_SENILA_SI_BOALA_ALZHEIMER","PSIHIATRIE_ACUTI","PSIHIATRIE_DEMENTE","PSIHIATRIE_PEDIATRICA_COPII","PSIHIATRIE","TERAPIE_OCUPATIONALA_SI_ERGOTERAPIE","INGRIJIRI_PALIATIVE","TOXICOMANIE"]
["PSIHIATRIE_CRONICI_16","COD_PENAL","BOLNAVI_PSIHICI_CU_TBC_PULMONAR","BOLNAVI_PSIHICI_CU_TBC_PULMONAR_COD_PENAL","CRONICI_AFECTIUNI_PSIHOSOMATICE","DEMENTA_SENILA_SI_BOALA_ALZHEIMER","PSIHIATRIE_ACUTI","PSIHIATRIE_DEMENTE","PSIHIATRIE_PEDIATRICA_COPII","PSIHIATRIE","TERAPIE_OCUPATIONALA_SI_ERGOTERAPIE","INGRIJIRI_PALIATIVE","TOXICOMANIE"]
["PSIHIATRIE_DROGODEPENDENTA","COD_PENAL","TOXICOMANIE"]
["PSIHIATRIE_GERONTOPSIHIATRIE","PSIHIATRIE_CRONICI"]
["PSIHIATRIE_PEDIATRICA_COPII","NEUROLOGIE_PEDIATRICA","PSIHIATRIE_CRONICI","TOXICOMANIE_DEZINTOXICARE"]
["PSIHIATRIE_PSIHOSOMATICA","PSIHIATRIE_CRONICI"]
["PSIHIATRIE_PSIHOZE","PSIHIATRIE_CRONICI"]
["PSIHIATRIE_TOXICOMANIE_1"]
["PSIHIATRIE_TOXICOMANIE_2"]
["RADIOTERAPIE_1","COBALTOTERAPIE","CRONICI","CURIETERAPIE","MEDICINA_NUCLEARA","TERAPIE_CU_IZOTOPI"]
["RADIOTERAPIE_2","COBALTOTERAPIE","CRONICI","CURIETERAPIE","MEDICINA_NUCLEARA","TERAPIE_CU_IZOTOPI"]
["RADIOTERAPIE_3","COBALTOTERAPIE","CRONICI","CURIETERAPIE","MEDICINA_NUCLEARA","TERAPIE_CU_IZOTOPI"]
["RADIOTERAPIE_M_AP_N","RADIOPATOLOGIE"]
["RADIOTERAPIE_CRONICI"]
["RECUPERARE_BOLI_CARDIOVASCULARE_1","TI_CORONARIENI"]
["RECUPERARE_BOLI_CARDIOVASCULARE_2","TI_CORONARIENI"]
["RECUPERARE_BOLI_CARDIOVASCULARE_3","TI_CORONARIENI"]
["RECUPERARE_BOLI_CARDIOVASCULARE_4","TI_CORONARIENI"]
["RECUPERARE_BOLI_CARDIOVASCULARE_5","TI_CORONARIENI"]
["RECUPERARE_BOLI_CARDIOVASCULARE_6","TI_CORONARIENI"]
["RECUPERARE_BOLI_CARDIOVASCULARE_7","TI_CORONARIENI"]
["RECUPERARE_BOLI_CARDIOVASCULARE_8","TI_CORONARIENI"]
["RECUPERARE_BOLI_CARDIOVASCULARE_9","TI_CORONARIENI"]
["RECUPERARE_BOLI_CARDIOVASCULARE_10","TI_CORONARIENI"]
["RECUPERARE_CARDIOLOGIE_COPII"]
["RECUPERARE_MEDICALA"]
["RECUPERARE_MEDICALA_CARDIOVASCULARA"]
["RECUPERARE_MEDICALA_CRONICI_DIABET_SI_HEMOFILIE"]
["RECUPERARE_MEDICALA_NEUROPSIHOMOTORIE_COPII"]
["RECUPERARE_MEDICALA_ORTOPEDIE_SI_TRAUMATOLOGIE_1"]
["RECUPERARE_MEDICALA_ORTOPEDIE_SI_TRAUMATOLOGIE_2"]
["RECUPERARE_MEDICALA_RESPIRATORIE_1"]
["RECUPERARE_MEDICALA_RESPIRATORIE_2"]
["RECUPERARE_MEDICALA_RESPIRATORIE_3"]
["RECUPERARE_MEDICINA_FIZICA_SI_BALNEOLOGIE_1","RECUPERARE_BOLI_CARDIOVASCULARE","RECUPERARE_BOLI_RESPIRATORII","RECUPERARE_NEUROLOGICA","RECUPERARE_NEUROMOTORIE_COPII","RECUPERARE_ORTOPEDIE_SI_TRAUMATOLOGIE","RECUPERARE_POSTTRAUMATICA","RECUPERARE_REUMATOLOGICA","REUMATOLOGIE","RECUPERARE_MEDICALA_NEUROPSIHOMOTORIE"]
["RECUPERARE_MEDICINA_FIZICA_SI_BALNEOLOGIE_2","RECUPERARE_BOLI_CARDIOVASCULARE","RECUPERARE_BOLI_RESPIRATORII","RECUPERARE_NEUROLOGICA","RECUPERARE_NEUROMOTORIE_COPII","RECUPERARE_ORTOPEDIE_SI_TRAUMATOLOGIE","RECUPERARE_POSTTRAUMATICA","RECUPERARE_REUMATOLOGICA","REUMATOLOGIE","RECUPERARE_MEDICALA_NEUROPSIHOMOTORIE"]
["RECUPERARE_MEDICINA_FIZICA_SI_BALNEOLOGIE_3","RECUPERARE_BOLI_CARDIOVASCULARE","RECUPERARE_BOLI_RESPIRATORII","RECUPERARE_NEUROLOGICA","RECUPERARE_NEUROMOTORIE_COPII","RECUPERARE_ORTOPEDIE_SI_TRAUMATOLOGIE","RECUPERARE_POSTTRAUMATICA","RECUPERARE_REUMATOLOGICA","REUMATOLOGIE","RECUPERARE_MEDICALA_NEUROPSIHOMOTORIE"]
["RECUPERARE_MEDICINA_FIZICA_SI_BALNEOLOGIE_4","RECUPERARE_BOLI_CARDIOVASCULARE","RECUPERARE_BOLI_RESPIRATORII","RECUPERARE_NEUROLOGICA","RECUPERARE_NEUROMOTORIE_COPII","RECUPERARE_ORTOPEDIE_SI_TRAUMATOLOGIE","RECUPERARE_POSTTRAUMATICA","RECUPERARE_REUMATOLOGICA","REUMATOLOGIE","RECUPERARE_MEDICALA_NEUROPSIHOMOTORIE"]
["RECUPERARE_MEDICINA_FIZICA_SI_BALNEOLOGIE_5","RECUPERARE_BOLI_CARDIOVASCULARE","RECUPERARE_BOLI_RESPIRATORII","RECUPERARE_NEUROLOGICA","RECUPERARE_NEUROMOTORIE_COPII","RECUPERARE_ORTOPEDIE_SI_TRAUMATOLOGIE","RECUPERARE_POSTTRAUMATICA","RECUPERARE_REUMATOLOGICA","REUMATOLOGIE","RECUPERARE_MEDICALA_NEUROPSIHOMOTORIE"]
["RECUPERARE_MEDICINA_FIZICA_SI_BALNEOLOGIE_COPII_1"]
["RECUPERARE_MEDICINA_FIZICA_SI_BALNEOLOGIE_COPII_2"]
["RECUPERARE_NEUROLOGICA_1","NEUROLOGIE"]
["RECUPERARE_NEUROLOGICA_2","NEUROLOGIE"]
["RECUPERARE_NEUROLOGICA_COPII"]
["RECUPERARE_NEUROLOGICA_CRONICI_1"]
["RECUPERARE_NEUROLOGICA_CRONICI_2"]
["RECUPERARE_NEUROMOTORIE_COPII_1"]
["RECUPERARE_NEUROMOTORIE_COPII_2"]
["RECUPERARE_NEUROMOTORIE"]
["RECUPERARE_NEUROMUSCULARA"]
["RECUPERARE_NEUROPSIHOMOTORIE"]
["RECUPERARE_NEUROPSIHOMOTORIE_COPII","TI","RECUPERARE_CRONICI_NEUROLOGIE_PEDIATRICA","RECUPERARE_NEUROLOGIE_COPII"]
["RECUPERARE_NEUROPSIHOMOTORIE_SI_POSTTRAUMATICA_COPII"]
["RECUPERARE_ORL_COPII_CU_HANDICAP_AUZ_VORBIRE_CIUBOTICA_CUCULUI"]
["RECUPERARE_ORTOPEDIE_SI_TRAUMATOLOGIE","CHIRURGIE_SI_ORTOPEDIE_INFANTILA_PEDIATRICA"]
["RECUPERARE_PEDIATRICA_DISTROFICI","PEDIATRIE_CRONICI"]
["RECUPERARE_TRAUMATOLOGICA_VERTEBROMEDULARA_SI_NEUROMOTORIE"]
["REUMATOLOGIE_1","RECUPERARE_MEDICINA_FIZICA_SI_BALNEOLOGIE"]
["REUMATOLOGIE_2","RECUPERARE_MEDICINA_FIZICA_SI_BALNEOLOGIE"]
["REUMATOLOGIE_3","RECUPERARE_MEDICINA_FIZICA_SI_BALNEOLOGIE"]
["TBC_OSTEOARTICULAR"]
["TOXICOLOGIE_1","TOXICOLOGIE_COPII"]
["TOXICOLOGIE_2","TOXICOLOGIE_COPII"]
["TOXICOMANIE_ELEVI_SI_STUDENTI"]
["TOXICOMANIE","TOXICOMANIE_COPII"]
["UROLOGIE_1","ATI","ENDOUROLOGIE","LITOTRITIE","TRANSPLANT_RENAL","UROLOGIE_COPII"]
["UROLOGIE_2","ATI","ENDOUROLOGIE","LITOTRITIE","TRANSPLANT_RENAL","UROLOGIE_COPII"]
["UROLOGIE_3","ATI","ENDOUROLOGIE","LITOTRITIE","TRANSPLANT_RENAL","UROLOGIE_COPII"]
["UROLOGIE_4","ATI","ENDOUROLOGIE","LITOTRITIE","TRANSPLANT_RENAL","UROLOGIE_COPII"]
["UNITATE_ARSI_GRAV"]
["UNITATE_DE_INGRIJIRE_ARSI_GRAV"]
["TERAPIE_CU_IZOTOPI"]
["UNITATE_DE_URGENTE_NEUROVASCULARE"]
["TERAPIE_INTENSIVA_TOXICOLOGIE"]
[]
[]
[]
[]
[]
[]
[]
[]
[]
[]
[]
[]
["Tip_sectie","Tip_clinic"]
["Sectie","Clinic"]
["Compartiment","Neclinic"]